{"text_format":"1","workbook":"xlsx","n_sheets":27,"sheets":["Auswahl","Deckblatt","Impressum","Inhaltsverzeichnis","Tab 1.1_roh","Tab 1.1","Tab 1.2_roh","Tab 1.2","Tab 2_roh","Tab 2","Tab 3","Tab 4","Tab 5","Tab 6","Tab 7.1","Tab 7.2","Tab 8.1_roh","Tab 8.1","Tab 8.2_roh","Tab 8.2","Hinweis_Schätzungen","Hinweis_Ausbildungsmarkt","Hinweis_Arbeitslosengeld","Hinweis_Alg_Revision","Hinweis_SGBII_erw-tät_ELB","Hinweise_Allgemein","Statistik-Infoseite"],"not_rendered":{"charts":12,"images":6,"macros":1,"external_links":0,"defined_names":27,"comments":0,"pivot_tables":0},"unopened":[],"bounds":{"document_bytes":16777216,"sheet_cells":100000,"rows_first":2000,"rows_last":500,"rows_between":2000,"halvings":0,"cell_chars":16384,"cell_head_chars":4096},"cells_cut":0,"cells_raw":0,"read":"whole","date_system":"1900"}

{"sheet":"Auswahl","index":0,"n_rows":6,"n_cols":6,"rows_kept":6,"cut":false,"hidden":true,"merged":[]}
["Rechtskreis",null,null,null,"Überschriften Blätter"]
[{"$f":"INDEX(A4:A6,A3)","v":"Insgesamt"},null,null,null,"1.1 Bestand an Arbeitsuchenden und Arbeitslosen",{"$f":"E2&$B$3","v":"1.1 Bestand an Arbeitsuchenden und Arbeitslosen "}]
[1,{"$f":"INDEX(B4:B6,A3)","v":" "},{"$f":"INDEX(C4:C6,A3)","v":" "},null,"1.2 Zugänge in und Abgänge aus Arbeitslosigkeit",{"$f":"E3&$B$3","v":"1.2 Zugänge in und Abgänge aus Arbeitslosigkeit "}]
["Insgesamt"," "," ",null,"2 Unterbeschäftigung","2 Unterbeschäftigung "]
["SGB III"," - Rechtskreis SGB III"," - Kostenträgerschaft SGB III",null,"8.1 Bestand in ausgewählten arbeitsmarktpolitischen Instrumenten",{"$f":"E5&$C$3","v":"8.1 Bestand in ausgewählten arbeitsmarktpolitischen Instrumenten "}]
["SGB II"," - Rechtskreis SGB II"," - Kostenträgerschaft SGB II",null,"8.2 Eintritte in ausgewählte arbeitsmarktpolitische Instrumente",{"$f":"E6&$C$3","v":"8.2 Eintritte in ausgewählte arbeitsmarktpolitische Instrumente "}]

{"sheet":"Deckblatt","index":1,"n_rows":0,"n_cols":0,"rows_kept":0,"cut":false,"hidden":false,"merged":[]}

{"sheet":"Impressum","index":2,"n_rows":44,"n_cols":3,"rows_kept":44,"cut":false,"hidden":false,"merged":[[28,2,28,5],[31,2,31,5],[15,2,15,5],[5,2,5,5],[6,2,6,5],[7,2,8,5],[9,2,9,5],[11,2,11,5]]}
[]
[]
[]
["Impressum"]
[]
["Produktlinie/Reihe:",null,"Tabellen"]
[]
["Titel:",null,"Frauen und Männer "]
[]
["Region:",null,"Deutschland (Gebietsstand: August 2020)"]
[]
["Berichtsmonat:",null,"August 2020"]
[]
["Erstellungsdatum:",null,"2020-09-15"]
[]
["Periodizität:",null,"zum 20. eines Monats oder zum nächsten darauffolgenden Werktag"]
[]
["Herausgeberin:",null,"Bundesagentur für Arbeit"]
[null,null,"Statistik"]
[]
["Rückfragen an:",null,"Zentraler Statistik-Service"]
[null,null,"Regensburger Straße 104"]
[null,null,"90478 Nürnberg"]
["E-Mail:",null,"Zentraler-Statistik-Service@arbeitsagentur.de"]
["Hotline:",null,"0911/179-3632"]
["Fax:",null,"0911/179-1131"]
[]
[]
["Internet:",null,"http://statistik.arbeitsagentur.de "]
[]
["Zitierhinweis:",null,"Statistik der Bundesagentur für Arbeit"]
[null,null,"Frauen und Männer, Deutschland, Nürnberg, August 2020"]
[]
["Nutzungsbedingungen:",null,"© Statistik der Bundesagentur für Arbeit"]
[null,null,"Sie können Informationen speichern, (auch auszugsweise) mit Quellen-"]
[null,null,"angabe weitergeben, vervielfältigen und verbreiten. Die Inhalte dürfen"]
[null,null,"nicht verändert oder verfälscht werden. Eigene Berechnungen sind"]
[null,null,"erlaubt, jedoch als solche kenntlich zu machen."]
[null,null,"Im Falle einer Zugänglichmachung im Internet soll dies in Form einer"]
[null,null,"Verlinkung auf die Homepage der Statistik der Bundesagentur für Arbeit"]
[null,null,"erfolgen. "]
[null,null,"Die Nutzung der Inhalte für gewerbliche Zwecke, ausgenommen Presse, "]
[null,null,"Rundfunk und Fernsehen und wissenschaftliche Publikationen, bedarf"]
[null,null,"der Genehmigung durch die Statistik der Bundesagentur für Arbeit. "]

{"sheet":"Inhaltsverzeichnis","index":3,"n_rows":35,"n_cols":2,"rows_kept":35,"cut":false,"hidden":false,"merged":[[34,1,34,6]]}
[]
[]
[]
["Inhaltsverzeichnis"]
[]
[]
["Frauen und Männer"]
["Deutschland (Gebietsstand: August 2020)"]
["August 2020"]
[]
["Tabelle"]
[]
["Tab 1.1","1.1 Bestand an Arbeitsuchenden und Arbeitslosen nach Rechtskreis"]
["Tab 1.2","1.2 Zugänge in und Abgänge aus Arbeitslosigkeit nach Rechtskreis"]
["Tab 2","2 Unterbeschäftigung nach Rechtskreis"]
["Tab 3","3 Gemeldete Arbeitsstellen"]
["Tab 4","4 Beschäftigte am Arbeitsort"]
["Tab 5","5 Gemeldete Bewerber für Berufsausbildungsstellen und gemeldete Berufsausbildungsstellen"]
["Tab 6","6 Leistungs- und Nichtleistungsempfänger im Rechtskreis SGB III"]
["Tab 7.1","7.1 Grundsicherung für Arbeitsuchende"]
["Tab 7.2","7.2 Erwerbstätige erwerbsfähige Leistungsberechtigte (ELB)"]
["Tab 8.1","8.1 Bestand in ausgewählten arbeitsmarktpolitischen Instrumenten nach Rechtskreis"]
["Tab 8.2","8.2 Eintritte in ausgewählte arbeitsmarktpolitische Instrumente nach Rechtskreis"]
[]
["Statistik-Info"]
[]
[]
["Zeichenerklärungen"]
[]
[" X","Nachweis nicht sinnvoll"]
[".X","Veränderung größer 250 Prozent"]
[" …","Angaben fallen später an "]
[" - ","nichts vorhanden  "]
[" .","auf Grund unvollständiger Daten ist kein Nachweis sinnvoll"]
[" *","Die erhobenen Daten unterliegen grundsätzlich der Geheimhaltung nach § 16 BStatG. Eine Übermittlung von Einzelangaben ist daher ausgeschlossen. Aus diesem Grund werden bei den Ihnen zur Verfügung gestellten Daten auch Zahlenwerte kleiner 3 und Daten, aus denen rechnerisch auf einen Zahlenwert kleiner 3 geschlossen werden kann, anonymisiert oder zu Gruppen zusammengefasst."]

{"sheet":"Tab 1.1_roh","index":4,"n_rows":136,"n_cols":49,"rows_kept":136,"cut":false,"hidden":true,"merged":[[54,7,59,7],[60,7,65,7],[66,7,71,7]]}
[null,null,"TabSpalten",null,null,null,null,null,null,null,null,null,null,null,null,null,null,null,null,null,null,null,null,null,null,null,null,null,null,null,null,null,null,null,null,null,null,null,null,null,null,null,null,null,null,null,null,null,"XXX"]
[null,null,"Hilfsspalten"]
[null,null,"Überschrift","1.1 Bestand an Arbeitsuchenden und Arbeitslosen "]
[null,null,"Gebiet","Deutschland (Gebietsstand: August 2020)"]
[null,null,"BM","2020-08-01"]
[]
[null,null,"Deutschland"]
[null,null,1]
[null,null,"Frauen","Frauen","Frauen","Frauen","Frauen","Frauen","Männer","Männer","Männer","Männer","Frauen","Frauen","Frauen","Frauen","Frauen","Frauen","Männer","Männer","Männer","Männer","Frauen","Frauen","Frauen","Frauen","Frauen","Frauen","Männer","Männer","Männer","Männer",null,"Frauen","Frauen","Frauen","Männer","Männer","Frauen","Frauen","Frauen","Männer","Männer","Frauen","Frauen","Frauen","Männer","Männer"]
[null,"Tab/DS","Anzahl","VJM","Anteil der\nPersonen-\ngruppe an\nInsgesamt\nin %","Verände-\nrung zum\nVorjahr\nin %","Gesamt","Anteil an\nFrauen\nund Männer\ninsgesamt\nin %","Anzahl","VJM","Anteil der\nPersonen-\ngruppe an\nInsgesamt\nin %","Verände-\nrung zum\nVorjahr\nin %","Anzahl","VJM","Anteil der\nPersonen-\ngruppe an\nInsgesamt\nin %","Verände-\nrung zum\nVorjahr\nin %","Gesamt","Anteil an\nFrauen\nund Männer\ninsgesamt\nin %","Anzahl","VJM","Anteil der\nPersonen-\ngruppe an\nInsgesamt\nin %","Verände-\nrung zum\nVorjahr\nin %","Anzahl","VJM","Anteil der\nPersonen-\ngruppe an\nInsgesamt\nin %","Verände-\nrung zum\nVorjahr\nin %","Gesamt","Anteil an\nFrauen\nund Männer\ninsgesamt\nin %","Anzahl","VJM","Anteil der\nPersonen-\ngruppe an\nInsgesamt\nin %","Verände-\nrung zum\nVorjahr\nin %",null,"Anteil der\nPersonen-\ngruppe an\nInsgesamt\nin %","Verände-\nrung zum\nVorjahr\nin %","Anteil an\nFrauen\nund Männer\ninsgesamt\nin %","Anteil der\nPersonen-\ngruppe an\nInsgesamt\nin %","Verände-\nrung zum\nVorjahr\nin %","Anteil der\nPersonen-\ngruppe an\nInsgesamt\nin %","Verände-\nrung zum\nVorjahr\nin %","Anteil an\nFrauen\nund Männer\ninsgesamt\nin %","Anteil der\nPersonen-\ngruppe an\nInsgesamt\nin %","Verände-\nrung zum\nVorjahr\nin %","Anteil der\nPersonen-\ngruppe an\nInsgesamt\nin %","Verände-\nrung zum\nVorjahr\nin %","Anteil an\nFrauen\nund Männer\ninsgesamt\nin %","Anteil der\nPersonen-\ngruppe an\nInsgesamt\nin %","Verände-\nrung zum\nVorjahr\nin %"]
[null,null,1,0,2,3,0,4,5,0,6,7,null,null,null,null,null,null,null,null,null,null,null,null,null,null,null,null,null,null,null,null,null,2,3,4,6,7]
[null,null,1,2,3,4,5,6,7,8,9,10,1,2,3,4,5,6,7,8,9,10,1,2,3,4,5,6,7,8,9,10,null,3,4,6,9,10,3,4,6,9,10,3,4,6,9,10]
[null,null,"1Insgesamt","2Insgesamt",null,null,"5Insgesamt",null,"7Insgesamt","8Insgesamt",null,null,"1SGB III","2SGB III",null,null,"5SGB III",null,"7SGB III","8SGB III",null,null,"1SGB II","2SGB II",null,null,"5SGB II",null,"7SGB II","8SGB II",null,null,null,"3Insgesamt","4Insgesamt","6Insgesamt","9Insgesamt","10Insgesamt","3SGB III","4SGB III","6SGB III","9SGB III","10SGB III","3SGB II","4SGB II","6SGB II","9SGB II","10SGB II"]
[null,"ID für Auswahl","Insgesamt",null,null,null,null,null,null,null,null,null,"SGB III",null,null,null,null,null,null,null,null,null,"SGB II"]
[null,null,2179119,1944174,null,null,4795271,null,2616119,2271727,null,null,857224,672356,null,null,1911028,null,1053772,762980,null,null,1321895,1271818,null,null,2884243,null,1562347,1508747,null,null,null,"X",12.084566504849874,45.443083404462435,"X",15.159920184071412,"X",27.495552951115183,44.856694930686523,"X",38.1126635036305,"X",3.9374344442365179,45.831609888625891,"X",3.5526168403317451]
[null,null,1305023,1050360,null,null,2955487,null,1650451,1269045,null,null,558404,380778,null,null,1302314,null,743897,467347,null,null,746619,669582,null,null,1653173,null,906554,801698,null,null,null,100,24.245306371148938,44.15593775239072,100,30.054568592918297,100,46.648178203572691,42.877831306428405,100,59.174446396360736,100,11.505237595992723,45.162786955751159,100,13.079239314554858]
[null,null,0,0,null,null,0,null,0,0,null,null,0,0,null,null,0,null,0,0,null,null,0,0,null,null,0,null,0,0]
[null,null,125329,97371,null,null,324139,null,198806,145461,null,null,63393,43725,null,null,170539,null,107142,66976,null,null,61936,53646,null,null,153600,null,91664,78485,null,null,null,9.6035855306764706,28.71286111881361,38.665202274332927,12.045556032866168,36.6730601329566,11.352533291308802,44.981132075471699,37.172142442491165,14.40280038768808,59.970735785953181,8.2955295806830538,15.453155873690488,40.322916666666671,10.111256472311632,16.791743645282541]
[null,null,314619,250132,null,null,741317,null,426695,315575,null,null,130609,85965,null,null,321595,null,190983,111443,null,null,184010,164167,null,null,419722,null,235712,204132,null,null,null,24.108310734753331,25.781187532982585,42.440548375391366,25.85323647899877,35.211914758773666,23.389696348880022,51.932763333914963,40.612882662976723,25.673312299955501,71.372809418267636,24.645769796911143,12.08708205668618,43.840923277788626,26.000878050287131,15.470381909744674]
[null,null,319405,251402,null,null,682687,null,363279,270393,null,null,115157,72210,null,null,257454,null,142294,81282,null,null,204248,179192,null,null,425233,null,220985,189111,null,null,null,24.475047566211476,27.049506368286647,46.786448255203339,22.010892780215833,34.352220656599833,20.622524193952767,59.475141947098741,44.729155499623232,19.128185756899143,75.062129376737772,27.35638926949354,13.98276708781642,48.032020092513989,24.376374711269268,16.854651500970331]
[null,null,277947,228730,null,null,603410,null,325461,264426,null,null,106895,71900,null,null,231350,null,124453,78150,null,null,171052,156830,null,null,372060,null,201008,186276,null,null,null,21.298245318281747,21.517509727626461,46.062710263336704,19.719519089024757,23.082072110911938,19.142950265399243,48.671766342141865,46.204884374324621,16.729869861015707,59.248880358285348,22.910212571606134,9.0684180322642352,45.974305219588238,22.172755290914829,7.9086946251798409]
[null,null,267646,222649,null,null,603787,null,336140,273119,null,null,142350,106978,null,null,321376,null,179025,129496,null,null,125296,115671,null,null,282411,null,157115,143623,null,null,null,20.508910570924805,20.209837008026085,44.327883839830932,20.366554353931139,23.074557244278136,25.492295900459165,33.064742283460156,44.293911181917757,24.06583169444157,38.247513436708466,16.781785622921465,8.3210139101416942,44.366543796098597,17.331013927465985,9.3940385592836808]
[null,null,391150,300043,null,null,877316,null,486161,355380,null,null,107299,63172,null,null,285821,null,178517,95940,null,null,283851,236871,null,null,591495,null,307644,259440,null,null,null,29.972651822994688,30.364647733824818,44.584847420997683,29.456251654850707,36.800326411165514,19.215299317340133,69.852149686570002,37.540628575227153,23.997542670557888,86.071503022722538,38.018185982408696,19.833580303203011,47.98874039510055,33.935540519373362,18.580018501387606]
[null,null,72194,63303,null,null,177722,null,105528,93149,null,null,35012,28457,null,null,83587,null,48575,39182,null,null,37182,34846,null,null,94135,null,56953,53967,null,null,null,5.5320097806705322,14.045147939276179,40.621870111747562,6.3938887007248324,13.289460971132272,6.2700123924613713,23.034754190533086,41.886896287700246,6.5298018408462459,23.972742585881271,4.9800500656961582,6.7037823566549957,39.498592447017586,6.2823615581642134,5.5330109140771206]
[null,1,42718,34944,null,null,46267,null,3549,2279,null,null,24931,18511,null,null,27336,null,2405,1289,null,null,17787,16433,null,null,18931,null,1144,990,null,null,null,3.2733522704197551,22.247023809523807,92.329305984827201,0.2150321336410472,55.726195699868363,4.4646886483621175,34.682080924855491,91.202077846063801,0.32329744574853775,86.578743211792087,2.3823395868575536,8.2395180429623327,93.957001743172569,0.12619215181886573,15.555555555555555]
[null,1,201731,176377,null,null,220968,null,19237,16066,null,null,38603,25110,null,null,43047,null,4444,2715,null,null,163128,151267,null,null,177921,null,14793,13351,null,null,null,15.458041735662897,14.374890150076258,91.294214546902722,1.1655602014237321,19.737333499315323,6.9130951784013002,53.735563520509757,89.676400213719887,0.59739453176985524,63.683241252302025,21.848894817838818,7.8411021571129194,91.685635759691095,1.6317836554689515,10.800689086959778]
[null,1,676025,546094,null,null,1537978,null,861947,660047,null,null,162383,95615,null,null,436396,null,274007,150246,null,null,513642,450479,null,null,1101582,null,587940,509801,null,null,null,51.801769010967625,23.79279025222764,43.955440194853239,52.224937305015416,30.588730802503456,29.079841834943878,69.830047586675732,37.210011090844098,36.83399717971708,82.372242855051041,68.795731156051474,14.021297330175214,46.627668208086185,64.854382640195723,15.327353222139619]
[null,1,527544,463201,null,null,1227060,null,699514,607513,null,null,106923,77327,null,null,200640,null,93715,62409,null,null,420621,385874,null,null,1026420,null,605799,545104,null,null,null,40.424115130537928,13.890945831291383,42.992518703241892,42.38320313659721,15.143873464436153,19.147964556127821,38.273824149391544,53.29096889952153,12.597846207203418,50.162636799179609,56.336766141767079,9.004752846784184,40.97942362775472,66.824370087165235,11.134572485250521]
[null,1,398228,323462,null,null,485923,null,87695,73488,null,null,186451,133294,null,null,215237,null,28786,20450,null,null,211777,190168,null,null,270686,null,58909,53038,null,null,null,30.515017742982309,23.114307090168243,81.952902002992246,5.3133961565656902,19.332408012192467,33.389982879778799,39.879514456764745,86.625905397306227,3.8696217352671134,40.762836185819076,28.364801860118749,11.363110512809726,78.237145622603308,6.4981236638964699,11.069421923903617]
[null,null,384960,334150,null,null,862610,null,477650,389788,null,null,55748,36855,null,null,123821,null,68073,42120,null,null,329212,297295,null,null,738789,null,409577,347668,null,null,null,29.498330680761946,15.2057459224899,44.627351873963903,28.940574424808734,22.540970989358318,9.9834528405956977,51.263057929724596,45.023057478133758,9.150863627625867,61.616809116809115,44.093707767951258,10.735801140281538,44.561031634201377,45.179548046779345,17.806930750025888]
[null,1,685967,526809,null,null,1442359,null,756389,549524,null,null,183520,94799,null,null,416644,null,233121,115150,null,null,502447,432010,null,null,1025715,null,523268,434374,null,null,null,52.56359466461511,"X",47.558686845646605,45.829230919306298,"X",32.865094089583884,"X",44.047196167471512,31.337806174779576,"X",67.296305076618737,"X",48.985049453308186,57.720554980729219,"X"]
[null,1,389227,353586,null,null,978454,null,589226,494025,null,null,241302,194676,null,null,564007,null,322704,226083,null,null,147925,158910,null,null,414447,null,266522,267942,null,null,null,29.825298098194438,"X",39.779795473267008,35.700908418365643,"X",43.212799335248313,"X",42.783511552161585,43.380199140472406,"X",19.812648753915987,"X",35.692139163753147,29.39946213904522,"X"]
[null,1,149428,107321,null,null,374023,null,224590,162535,null,null,116770,81563,null,null,285083,null,168308,114923,null,null,32658,25758,null,null,88940,null,56282,47612,null,null,null,11.450219651301165,39.2346325509453,39.951553781451942,13.607795687360607,38.179469037438089,20.911383156281115,43.165405882569303,40.960001122480122,22.625175259478127,46.452842337913211,4.3741185263166349,26.787794083391571,36.719136496514501,6.2083450075781474,18.20969503486516]
[null,1,80401,62644,null,null,160651,null,80246,62961,null,null,16812,9740,null,null,36580,null,19764,11191,null,null,63589,52904,null,null,124071,null,60482,51770,null,null,null,6.1608875858892906,28.345891066981675,50.046996283870001,4.8620649749674483,27.453502962151173,3.010723418886684,72.607802874743328,45.959540732640782,2.6568194252698962,76.606201411848801,8.516927643148648,20.196960532284894,51.252105649184742,6.6716378726474099,16.828278926018932]
[null,1,52243,38272,null,null,364251,null,312008,227759,null,null,38988,26755,null,null,241516,null,202528,128565,null,null,13255,11517,null,null,122735,null,109480,99194,null,null,null,4.0032244642431589,36.504494147157189,14.342582450013863,18.90440855257139,36.99041530740827,6.9820416759192279,45.722294898149876,16.143029861375645,27.225274466760858,57.529654260490801,1.7753365505030008,15.090735434574976,10.799690389864342,12.076500682805436,10.369578805169667]
[null,1,97753,76811,null,null,652781,null,555028,430156,null,null,51549,34581,null,null,312038,null,260489,160707,null,null,46204,42230,null,null,340743,null,294539,269449,null,null,null,7.490519324180493,27.264324120243195,14.97485374114749,33.628868715278429,29.029468378913698,9.2314883131209662,49.067406957577859,16.520103320749396,35.016810122906797,62.089392496904303,6.1884307792863558,9.410371773620648,13.559779657982702,32.489956472532249,9.3115951441645723]
[null,1,417317,332277,null,null,624804,null,207485,150086,null,null,183652,124778,null,null,279753,null,96099,55577,null,null,233665,207499,null,null,345051,null,111386,94509,null,null,null,31.97775058370619,25.593104548313605,66.791665866415713,12.571412298820139,38.244073397918527,32.888732888732889,47.18299700267675,65.64791083563,12.918320681492196,72.911456177915326,31.296417583801105,12.61018125388556,67.718974876177725,12.28674739728687,17.857558539398362]
[null,1,419526,335609,null,null,674698,null,255166,197308,null,null,226057,156795,null,null,366205,null,140142,94911,null,null,193469,178814,null,null,308493,null,115024,102397,null,null,null,32.147019631071636,25.004394995366631,62.179819711930371,15.460380223345012,29.323696961096356,40.482697115350177,44.173602474568703,61.729632309771851,18.838898395880076,47.656225305812818,25.912681032762357,8.1956670059391321,62.714226903041556,12.688047264696865,12.331415959451936]
[null,1,13752,10772,null,null,57425,null,43673,33325,null,null,10137,7622,null,null,38260,null,28123,19735,null,null,3615,3150,null,null,19165,null,15550,13590,null,null,null,1.0537745311768452,27.664314890456737,23.947757945145842,2.6461252106242474,31.051762940735184,1.815352325556407,32.996588821831537,26.495033978044958,3.7804964934661651,42.503166962249814,0.48418269559172755,14.761904761904763,18.86250978345943,1.7152866790064354,14.422369389256806]
[null,1,276274,232247,null,null,785128,null,508853,395209,null,null,70197,47262,null,null,269478,null,199280,125226,null,null,206077,184985,null,null,515650,null,309573,269983,null,null,null,21.170048343975548,18.956972533552641,35.188402400627666,30.831148576964722,28.755418019326484,12.571005938352878,48.527358131268251,26.049250773718075,26.788654880984868,59.136281602862027,27.601360265409802,11.402005568019028,39.964510811597016,34.148324313830173,14.663886244689481]
[null,1,80401,62644,null,null,160651,null,80246,62961,null,null,16812,9740,null,null,36580,null,19764,11191,null,null,63589,52904,null,null,124071,null,60482,51770,null,null,null,6.1608875858892906,28.345891066981675,50.046996283870001,4.8620649749674483,27.453502962151173,3.010723418886684,72.607802874743328,45.959540732640782,2.6568194252698962,76.606201411848801,8.516927643148648,20.196960532284894,51.252105649184742,6.6716378726474099,16.828278926018932]
[]
[]
[]
[]
[]
[]
[null,null,6.1,4.9000000000000004,null,null,"X",null,6.8,5.3,null,null,2.6,1.8,null,null,"X",null,3.1,1.9,null,null,3.5,3.1,null,null,"X",null,3.7,3.3,null,null,null,"X",1.1999999999999993,"X","X",1.5,"X",0.8,"X","X",1.2000000000000002,"X",0.39999999999999991,"X","X",0.40000000000000036]
[]
[]
[null,"DiaDatRoh",null,null,null,null,null,"DiaDatRohDS"]
[]
[]
[null,null,null,null,"Frauen","Männer",null,null,null,"Frauen","Männer"]
[1,"X","Insgesamt","XInsgesamt",0,0,null,"insg","XInsgesamt",0,0]
[1,"S1","Insgesamt","S1Insgesamt",97753,555028,null,null,"S1Insgesamt",97753,555028]
[1,"S2","Insgesamt","S2Insgesamt",417317,207485,null,null,"S2Insgesamt",417317,207485]
[1,"S3","Insgesamt","S3Insgesamt",419526,255166,null,null,"S3Insgesamt",419526,255166]
[1,"S4","Insgesamt","S4Insgesamt",13752,43673,null,null,"S4Insgesamt",13752,43673]
[1,"S5","Insgesamt","S5Insgesamt",276274,508853,null,null,"S5Insgesamt",276274,508853]
[1,"X","SGB III","XSGB III",0,0,null,"III","XSGB III",0,0]
[1,"S1","SGB III","S1SGB III",51549,260489,null,null,"S1SGB III",51549,260489]
[1,"S2","SGB III","S2SGB III",183652,96099,null,null,"S2SGB III",183652,96099]
[1,"S3","SGB III","S3SGB III",226057,140142,null,null,"S3SGB III",226057,140142]
[1,"S4","SGB III","S4SGB III",10137,28123,null,null,"S4SGB III",10137,28123]
[1,"S5","SGB III","S5SGB III",70197,199280,null,null,"S5SGB III",70197,199280]
[1,"X","SGB II","XSGB II",0,0,null,"II","XSGB II",0,0]
[1,"S1","SGB II","S1SGB II",46204,294539,null,null,"S1SGB II",46204,294539]
[1,"S2","SGB II","S2SGB II",233665,111386,null,null,"S2SGB II",233665,111386]
[1,"S3","SGB II","S3SGB II",193469,115024,null,null,"S3SGB II",193469,115024]
[1,"S4","SGB II","S4SGB II",3615,15550,null,null,"S4SGB II",3615,15550]
[1,"S5","SGB II","S5SGB II",206077,309573,null,null,"S5SGB II",206077,309573]
[]
[]
[]
[null,"Tab/Ausw","Frauen","Frauen","Frauen","Frauen","Männer","Männer","Männer"]
[null,null,"Zugang/\nAbgang","Anteil der\nMerkmals-\ngruppe an\nInsgesamt\nin %","Verände-\nrung zum\nVorjahr\nin %","Anteil an\nallen Personen\nin %","Zugang/\nAbgang","Anteil der\nMerkmals-\ngruppe an\nInsgesamt\nin %","Verände-\nrung zum\nVorjahr\nin %"]
[null,null,1,2,3,4,5,6,7]
[null,{"$f":"Auswahl!$A$2","v":"Insgesamt"},1,3,4,6,7,9,10,"Spalte in der Tabelle Tab/DS für Insgesamt"]
[null,null,{"$f":"MATCH(C79&$B$79,$C$13:$AV$13,0)","v":1},{"$f":"MATCH(D79&$B$79,$C$13:$AV$13,0)","v":32},33,34,7,35,36,"ID"]
[1,"Insgesamt",{"$f":"INDEX($C$15:$AV$41,$A81,C$80)","v":2179119},"X",12.084566504849874,45.443083404462435,2616119,"X",15.159920184071412]
[2,"Insgesamt",1305023,100,24.245306371148938,44.15593775239072,1650451,100,30.054568592918297]
[4,"15 bis unter 25 Jahre",125329,9.6035855306764706,28.71286111881361,38.665202274332927,198806,12.045556032866168,36.6730601329566]
[5,"25 bis unter 35 Jahre",314619,24.108310734753331,25.781187532982585,42.440548375391366,426695,25.85323647899877,35.211914758773666]
[6,"35 bis unter 45 Jahre",319405,24.475047566211476,27.049506368286647,46.786448255203339,363279,22.010892780215833,34.352220656599833]
[7,"45 bis unter 55 Jahre",277947,21.298245318281747,21.517509727626461,46.062710263336704,325461,19.719519089024757,23.082072110911938]
[8,"55 Jahre und älter",267646,20.508910570924805,20.209837008026085,44.327883839830932,336140,20.366554353931139,23.074557244278136]
[16,"Langzeitarbeitslose",384960,29.498330680761946,15.2057459224899,44.627351873963903,477650,28.940574424808734,22.540970989358318]
[12,"Alleinerziehende",201731,15.458041735662897,14.374890150076258,91.294214546902722,19237,1.1655602014237321,19.737333499315323]
[10,"Schwerbeheinderte Menschen",72194,5.5320097806705322,14.045147939276179,40.621870111747562,105528,6.3938887007248324,13.289460971132272]
[11,"Berufsrückkehrende",42718,3.2733522704197551,22.247023809523807,92.329305984827201,3549,0.2150321336410472,55.726195699868363]
[13,"Ohne abgeschlossene Berufsausbildung",676025,51.801769010967625,23.79279025222764,43.955440194853239,861947,52.224937305015416,30.588730802503456]
[9,"Ausländer",391150,29.972651822994688,30.364647733824818,44.584847420997683,486161,29.456251654850707,36.800326411165514]
[]
[14,"Teilzeit",{"$f":"INDEX($C$15:$AV$41,$A95,C$80)","v":527544},40.424115130537928,13.890945831291383,42.992518703241892,699514,42.38320313659721,15.143873464436153]
[15,"Teilzeit oder Vollzeit",398228,30.515017742982309,23.114307090168243,81.952902002992246,87695,5.3133961565656902,19.332408012192467]
[]
[17,"Helfer",{"$f":"INDEX($C$15:$AV$41,$A98,C$80)","v":685967},52.56359466461511,"X",47.558686845646605,756389,45.829230919306298,"X"]
[18,"Fachkraft",389227,29.825298098194438,"X",39.779795473267008,589226,35.700908418365643,"X"]
[19,"Spezialist/Experte",149428,11.450219651301165,39.2346325509453,39.951553781451942,224590,13.607795687360607,38.179469037438089]
[20,"keine Angabe zum Anforderungsniveau",80401,6.1608875858892906,28.345891066981675,50.046996283870001,80246,4.8620649749674483,27.453502962151173]
[]
[21,"MINT-Berufe",{"$f":"INDEX($C$15:$AV$41,$A103,C$80)","v":52243},4.0032244642431589,36.504494147157189,14.342582450013863,312008,18.90440855257139,36.99041530740827]
[1,"Arbeitslosenquote",{"$f":"INDEX($C$48:$AU$48,$A104,C$80)","v":6.1},"X",1.1999999999999993,"X",6.8,"X",{"$f":"INDEX($C$48:$AV$48,$A104,I$80)","v":1.5}]
[]
[22,"S1",{"$f":"INDEX($C$15:$AV$41,$A106,C$80)","v":97753},7.490519324180493,27.264324120243195,14.97485374114749,555028,33.628868715278429,29.029468378913698]
[23,"S2",417317,31.97775058370619,25.593104548313605,66.791665866415713,207485,12.571412298820139,38.244073397918527]
[24,"S3",419526,32.147019631071636,25.004394995366631,62.179819711930371,255166,15.460380223345012,29.323696961096356]
[25,"S4",13752,1.0537745311768452,27.664314890456737,23.947757945145842,43673,2.6461252106242474,31.051762940735184]
[26,"S5",276274,21.170048343975548,18.956972533552641,35.188402400627666,508853,30.831148576964722,28.755418019326484]
[27,"kA_SX",80401,6.1608875858892906,28.345891066981675,50.046996283870001,80246,4.8620649749674483,27.453502962151173]
[]
[]
[null,"DiaDat"]
[null,null,null,null,2,3]
[null,null,null,null,"Frauen","Männer"]
[null,"X",null,{"$f":"B117&$B$79","v":"XInsgesamt"},{"$f":"VLOOKUP($D117,$D$55:$F$72,E$115,0)","v":0},{"$f":"VLOOKUP($D117,$D$55:$F$72,F$115,0)","v":0}]
[null,"S1",{"$f":"$C$8","v":1},{"$f":"B118&$B$79","v":"S1Insgesamt"},{"$f":"IF(AND($C118=0,E$117>0),#N/A,VLOOKUP($D118,$D$55:$F$72,E$115,0))","v":97753},555028]
[null,"S2",{"$f":"$C$8","v":1},{"$f":"B119&$B$79","v":"S2Insgesamt"},417317,207485]
[null,"S3",{"$f":"$C$8","v":1},"S3Insgesamt",419526,255166]
[null,"S4",{"$f":"$C$8","v":1},"S4Insgesamt",13752,43673]
[null,"S5",{"$f":"$C$8","v":1},"S5Insgesamt",276274,508853]
[]
[]
[null,"DiaDS, DatenBeschriftungen "]
[null,null,null,null,2,3]
[null,null,null,null,"Frauen","Männer"]
[null,"S1",{"$f":"$C$8","v":1},{"$f":"B128&$B$79","v":"S1Insgesamt"},{"$f":"IF(AND($C128=0,E$117>0),\"\",\"Frauen\"&CHAR(10)&TEXT(VLOOKUP($D128,$I$55:$K$72,E$126,0),\"###.###\"))","v":"Frauen\n97.753"},{"$f":"IF(AND($C128=0,F$117>0),\"\",\"Männer\"&CHAR(10)&TEXT(VLOOKUP($D128,$I$55:$K$72,F$126,0),\"###.###\"))","v":"Männer\n555.028"},"Produktionsberufe"]
[null,"S2",{"$f":"$C$8","v":1},{"$f":"B129&$B$79","v":"S2Insgesamt"},{"$f":"IF(AND($C129=0,E$117>0),\"\",VLOOKUP($D129,$I$55:$K$72,E$126,0))","v":417317},207485,"personenbezogene\nDienstleistungsberufe"]
[null,"S3",{"$f":"$C$8","v":1},"S3Insgesamt",419526,255166,"kaufmännische und\nunternehmensbezogene\nDienstleistungsberufe"]
[null,"S4",{"$f":"$C$8","v":1},"S4Insgesamt",13752,43673,"IT- und naturwissenschaftl.\nDienstleistungsberufe"]
[null,"S5",{"$f":"$C$8","v":1},"S5Insgesamt",276274,508853,"sonstige wirtschaftl.\nDienstleistungsberufe"]
[]
[null,"Text bei unvollständiger Datenlieferung"]
[null,{"$f":"IF(E128=\"\",B136,\"\")","v":""}]
[null,"Auf Grund unvollständiger Daten kann keine Grafik angezeigt werden."]

{"sheet":"Tab 1.1","index":5,"n_rows":63,"n_cols":9,"rows_kept":63,"cut":false,"hidden":false,"merged":[[60,0,60,8],[62,0,62,8],[59,0,59,8],[2,10,2,15],[31,0,33,1],[31,2,31,5],[31,6,31,8],[22,0,29,8],[4,0,4,1],[61,0,61,8]]}
[null,null,null,null,null,null,null,null,"Frauen und Männer"]
[]
[{"$f":"Auswahl!F2","v":"1.1 Bestand an Arbeitsuchenden und Arbeitslosen "}]
[{"$f":"'Tab 1.1_roh'!D4","v":"Deutschland (Gebietsstand: August 2020)"}]
[{"$f":"'Tab 1.1_roh'!D5","v":"2020-08-01"}]
[]
[]
[]
[]
[]
[]
[]
[]
[]
[]
[]
[]
[]
[]
[]
[]
[]
["\nDie Arbeitsuchenden setzen sich zusammen aus Arbeitslosen und nichtarbeitslosen Arbeitsuchenden. Als Arbeitslose zählen Personen, die die Arbeitslosenkriterien Beschäftigungslosigkeit, Verfügbarkeit und Arbeitssuche erfüllen und nicht an einer arbeitsmarktpolitischen Maßnahme teilnehmen.\n\nArbeitslosenquoten zeigen die relative Unterauslastung des Arbeitskräfteangebots an, indem sie die (registrierten) Arbeitslosen zu den Erwerbspersonen (EP = Erwerbstätige + Arbeitslose) in Beziehung setzen."]
[]
[]
[]
[]
[]
[]
[]
[]
["Merkmale",null,"Frauen",null,null,null,"Männer"]
[null,null,"Bestand","Anteil an\nMerkmals-\ngruppe\nin %","Verände-\nrung zum\nVorjahr in\n%(-punkten)","Anteil\nFrauen\nan allen\nPersonen\nin %","Bestand","Anteil an\nMerkmals-\ngruppe\nin %","Verände-\nrung zum\nVorjahr in\n%(-punkten)"]
[null,null,1,2,3,4,5,6,7]
["Arbeitsuchende",null,{"$f":"'Tab 1.1_roh'!C81","v":2179119},{"$f":"'Tab 1.1_roh'!D81","v":"X"},{"$f":"'Tab 1.1_roh'!E81","v":12.084566504849874},{"$f":"'Tab 1.1_roh'!F81","v":45.443083404462435},{"$f":"'Tab 1.1_roh'!G81","v":2616119},{"$f":"'Tab 1.1_roh'!H81","v":"X"},{"$f":"'Tab 1.1_roh'!I81","v":15.159920184071412}]
["Arbeitslose",null,{"$f":"'Tab 1.1_roh'!C82","v":1305023},{"$f":"'Tab 1.1_roh'!D82","v":100},{"$f":"'Tab 1.1_roh'!E82","v":24.245306371148938},{"$f":"'Tab 1.1_roh'!F82","v":44.15593775239072},{"$f":"'Tab 1.1_roh'!G82","v":1650451},{"$f":"'Tab 1.1_roh'!H82","v":100},{"$f":"'Tab 1.1_roh'!I82","v":30.054568592918297}]
["dav.:","unter 25 Jahre",{"$f":"'Tab 1.1_roh'!C83","v":125329},{"$f":"'Tab 1.1_roh'!D83","v":9.6035855306764706},{"$f":"'Tab 1.1_roh'!E83","v":28.71286111881361},{"$f":"'Tab 1.1_roh'!F83","v":38.665202274332927},{"$f":"'Tab 1.1_roh'!G83","v":198806},{"$f":"'Tab 1.1_roh'!H83","v":12.045556032866168},{"$f":"'Tab 1.1_roh'!I83","v":36.6730601329566}]
[null,"25 bis unter 35 Jahre",{"$f":"'Tab 1.1_roh'!C84","v":314619},{"$f":"'Tab 1.1_roh'!D84","v":24.108310734753331},{"$f":"'Tab 1.1_roh'!E84","v":25.781187532982585},{"$f":"'Tab 1.1_roh'!F84","v":42.440548375391366},{"$f":"'Tab 1.1_roh'!G84","v":426695},{"$f":"'Tab 1.1_roh'!H84","v":25.85323647899877},{"$f":"'Tab 1.1_roh'!I84","v":35.211914758773666}]
[null,"35 bis unter 45 Jahre",{"$f":"'Tab 1.1_roh'!C85","v":319405},{"$f":"'Tab 1.1_roh'!D85","v":24.475047566211476},{"$f":"'Tab 1.1_roh'!E85","v":27.049506368286647},{"$f":"'Tab 1.1_roh'!F85","v":46.786448255203339},{"$f":"'Tab 1.1_roh'!G85","v":363279},{"$f":"'Tab 1.1_roh'!H85","v":22.010892780215833},{"$f":"'Tab 1.1_roh'!I85","v":34.352220656599833}]
[null,"45 bis unter 55 Jahre",{"$f":"'Tab 1.1_roh'!C86","v":277947},{"$f":"'Tab 1.1_roh'!D86","v":21.298245318281747},{"$f":"'Tab 1.1_roh'!E86","v":21.517509727626461},{"$f":"'Tab 1.1_roh'!F86","v":46.062710263336704},{"$f":"'Tab 1.1_roh'!G86","v":325461},{"$f":"'Tab 1.1_roh'!H86","v":19.719519089024757},{"$f":"'Tab 1.1_roh'!I86","v":23.082072110911938}]
[null,"55 Jahre und älter",{"$f":"'Tab 1.1_roh'!C87","v":267646},{"$f":"'Tab 1.1_roh'!D87","v":20.508910570924805},{"$f":"'Tab 1.1_roh'!E87","v":20.209837008026085},{"$f":"'Tab 1.1_roh'!F87","v":44.327883839830932},{"$f":"'Tab 1.1_roh'!G87","v":336140},{"$f":"'Tab 1.1_roh'!H87","v":20.366554353931139},{"$f":"'Tab 1.1_roh'!I87","v":23.074557244278136}]
["dar.:","Langzeitarbeitslose",{"$f":"'Tab 1.1_roh'!C88","v":384960},{"$f":"'Tab 1.1_roh'!D88","v":29.498330680761946},{"$f":"'Tab 1.1_roh'!E88","v":15.2057459224899},{"$f":"'Tab 1.1_roh'!F88","v":44.627351873963903},{"$f":"'Tab 1.1_roh'!G88","v":477650},{"$f":"'Tab 1.1_roh'!H88","v":28.940574424808734},{"$f":"'Tab 1.1_roh'!I88","v":22.540970989358318}]
[null,"Alleinerziehende",{"$f":"'Tab 1.1_roh'!C89","v":201731},{"$f":"'Tab 1.1_roh'!D89","v":15.458041735662897},{"$f":"'Tab 1.1_roh'!E89","v":14.374890150076258},{"$f":"'Tab 1.1_roh'!F89","v":91.294214546902722},{"$f":"'Tab 1.1_roh'!G89","v":19237},{"$f":"'Tab 1.1_roh'!H89","v":1.1655602014237321},{"$f":"'Tab 1.1_roh'!I89","v":19.737333499315323}]
[null,"Schwerbehinderte Menschen",{"$f":"'Tab 1.1_roh'!C90","v":72194},{"$f":"'Tab 1.1_roh'!D90","v":5.5320097806705322},{"$f":"'Tab 1.1_roh'!E90","v":14.045147939276179},{"$f":"'Tab 1.1_roh'!F90","v":40.621870111747562},{"$f":"'Tab 1.1_roh'!G90","v":105528},{"$f":"'Tab 1.1_roh'!H90","v":6.3938887007248324},{"$f":"'Tab 1.1_roh'!I90","v":13.289460971132272}]
[null,"Berufsrückkehrende",{"$f":"'Tab 1.1_roh'!C91","v":42718},{"$f":"'Tab 1.1_roh'!D91","v":3.2733522704197551},{"$f":"'Tab 1.1_roh'!E91","v":22.247023809523807},{"$f":"'Tab 1.1_roh'!F91","v":92.329305984827201},{"$f":"'Tab 1.1_roh'!G91","v":3549},{"$f":"'Tab 1.1_roh'!H91","v":0.2150321336410472},{"$f":"'Tab 1.1_roh'!I91","v":55.726195699868363}]
[null,"ohne abgeschlossene Berufsausbildung",{"$f":"'Tab 1.1_roh'!C92","v":676025},{"$f":"'Tab 1.1_roh'!D92","v":51.801769010967625},{"$f":"'Tab 1.1_roh'!E92","v":23.79279025222764},{"$f":"'Tab 1.1_roh'!F92","v":43.955440194853239},{"$f":"'Tab 1.1_roh'!G92","v":861947},{"$f":"'Tab 1.1_roh'!H92","v":52.224937305015416},{"$f":"'Tab 1.1_roh'!I92","v":30.588730802503456}]
[null,"Ausländer",{"$f":"'Tab 1.1_roh'!C93","v":391150},{"$f":"'Tab 1.1_roh'!D93","v":29.972651822994688},{"$f":"'Tab 1.1_roh'!E93","v":30.364647733824818},{"$f":"'Tab 1.1_roh'!F93","v":44.584847420997683},{"$f":"'Tab 1.1_roh'!G93","v":486161},{"$f":"'Tab 1.1_roh'!H93","v":29.456251654850707},{"$f":"'Tab 1.1_roh'!I93","v":36.800326411165514}]
["nach Arbeitszeit 1)"]
["dar.:","Vollzeit oder Teilzeit",{"$f":"'Tab 1.1_roh'!C95","v":527544},{"$f":"'Tab 1.1_roh'!D95","v":40.424115130537928},{"$f":"'Tab 1.1_roh'!E95","v":13.890945831291383},{"$f":"'Tab 1.1_roh'!F95","v":42.992518703241892},{"$f":"'Tab 1.1_roh'!G95","v":699514},{"$f":"'Tab 1.1_roh'!H95","v":42.38320313659721},{"$f":"'Tab 1.1_roh'!I95","v":15.143873464436153}]
[null,"Teilzeit",{"$f":"'Tab 1.1_roh'!C96","v":398228},{"$f":"'Tab 1.1_roh'!D96","v":30.515017742982309},{"$f":"'Tab 1.1_roh'!E96","v":23.114307090168243},{"$f":"'Tab 1.1_roh'!F96","v":81.952902002992246},{"$f":"'Tab 1.1_roh'!G96","v":87695},{"$f":"'Tab 1.1_roh'!H96","v":5.3133961565656902},{"$f":"'Tab 1.1_roh'!I96","v":19.332408012192467}]
["nach Anforderungsniveau"]
["dav.:","Helfer 2)",{"$f":"'Tab 1.1_roh'!C98","v":685967},{"$f":"'Tab 1.1_roh'!D98","v":52.56359466461511},{"$f":"'Tab 1.1_roh'!E98","v":"X"},{"$f":"'Tab 1.1_roh'!F98","v":47.558686845646605},{"$f":"'Tab 1.1_roh'!G98","v":756389},{"$f":"'Tab 1.1_roh'!H98","v":45.829230919306298},{"$f":"'Tab 1.1_roh'!I98","v":"X"}]
[null,"Fachkraft 2)",{"$f":"'Tab 1.1_roh'!C99","v":389227},{"$f":"'Tab 1.1_roh'!D99","v":29.825298098194438},{"$f":"'Tab 1.1_roh'!E99","v":"X"},{"$f":"'Tab 1.1_roh'!F99","v":39.779795473267008},{"$f":"'Tab 1.1_roh'!G99","v":589226},{"$f":"'Tab 1.1_roh'!H99","v":35.700908418365643},{"$f":"'Tab 1.1_roh'!I99","v":"X"}]
[null,"Spezialist/Experte",{"$f":"'Tab 1.1_roh'!C100","v":149428},{"$f":"'Tab 1.1_roh'!D100","v":11.450219651301165},{"$f":"'Tab 1.1_roh'!E100","v":39.2346325509453},{"$f":"'Tab 1.1_roh'!F100","v":39.951553781451942},{"$f":"'Tab 1.1_roh'!G100","v":224590},{"$f":"'Tab 1.1_roh'!H100","v":13.607795687360607},{"$f":"'Tab 1.1_roh'!I100","v":38.179469037438089}]
[null,"keine Angabe zum Anforderungsniveau",{"$f":"'Tab 1.1_roh'!C101","v":80401},{"$f":"'Tab 1.1_roh'!D101","v":6.1608875858892906},{"$f":"'Tab 1.1_roh'!E101","v":28.345891066981675},{"$f":"'Tab 1.1_roh'!F101","v":50.046996283870001},{"$f":"'Tab 1.1_roh'!G101","v":80246},{"$f":"'Tab 1.1_roh'!H101","v":4.8620649749674483},{"$f":"'Tab 1.1_roh'!I101","v":27.453502962151173}]
["nach ausgewählten Merkmalen der Berufsklassifikation"]
["dar.:","MINT-Berufe 3)",{"$f":"'Tab 1.1_roh'!C103","v":52243},{"$f":"'Tab 1.1_roh'!D103","v":4.0032244642431589},{"$f":"'Tab 1.1_roh'!E103","v":36.504494147157189},{"$f":"'Tab 1.1_roh'!F103","v":14.342582450013863},{"$f":"'Tab 1.1_roh'!G103","v":312008},{"$f":"'Tab 1.1_roh'!H103","v":18.90440855257139},{"$f":"'Tab 1.1_roh'!I103","v":36.99041530740827}]
[{"$f":"IF('Tab 1.1_roh'!B79=\"Insgesamt\",\"Arbeitslosenquote (in %)\",\"Arbeitslosenquote (rechtskreisanteilig, in %)\")","v":"Arbeitslosenquote (in %)"},null,{"$f":"'Tab 1.1_roh'!C104","v":6.1},{"$f":"'Tab 1.1_roh'!D104","v":"X"},{"$f":"'Tab 1.1_roh'!E104","v":1.1999999999999993},{"$f":"'Tab 1.1_roh'!F104","v":"X"},{"$f":"'Tab 1.1_roh'!G104","v":6.8},{"$f":"'Tab 1.1_roh'!H104","v":"X"},{"$f":"'Tab 1.1_roh'!I104","v":1.5}]
[null,null,null,null,null,null,null,null,"© Statistik der Bundesagentur für Arbeit "]
[{"$f":"IF('Tab 1.1_roh'!B135<>\"\",\"Aufgrund unvollständiger Daten können einige Merkmale nicht ausgewertet werden, da diese nicht geschätzt werden.\",\"\")","v":""}]
["1) Angaben zur gewünschten Arbeitszeit sind nicht im Lieferumfang der zugelassenen kommunalen Träger (zkT) an die Bundesagentur für Arbeit enthalten. Daher werden die gemeldeten Arbeitslosen und Arbeitsuchenden bei zkT grundsätzlich der Kategorie „Vollzeit oder Teilzeit“ (Oberkategorie \"Vollzeit\") zugeordnet."]
["2) Ab Januar 2020 gehören einige Berufspositionen nach der KldB 2010 zum Anforderungsniveau „Helfer“, die bisher dem Anforderungsniveau „Fachkraft“ zugeordnet waren. Nähere Informationen finden Sie in der Kurzinfo unter \nhttps://statistik.arbeitsagentur.de/DE/Statischer-Content/Statistiken/Fachstatistiken/Arbeitsuche-Arbeitslosigkeit-Unterbeschaeftigung/Generische-Publikationen/Kurzinfo-DKZ-Aenderungen.pdf"]
["3) Weiterführende Hinweise zu Berufsaggregaten"]

{"sheet":"Tab 1.2_roh","index":6,"n_rows":159,"n_cols":49,"rows_kept":159,"cut":false,"hidden":true,"merged":[]}
[null,null,"TabSpalten",null,null,null,null,null,null,null,null,null,null,null,null,null,null,null,null,null,null,null,null,null,null,null,null,null,null,null,null,null,null,null,null,null,null,null,null,null,null,null,null,null,null,null,null,null,"XXX"]
[null,null,"Hilfsspalten"]
[null,null,"Überschrift","1.2 Zugänge in und Abgänge aus Arbeitslosigkeit "]
[null,null,"Gebiet","Deutschland (Gebietsstand: August 2020)"]
[null,null,"BM","2020-08-01"]
[]
[null,null,"Deutschland"]
[null,null,1]
[null,null,"Frauen","Frauen","Frauen","Frauen","Frauen","Frauen","Männer","Männer","Männer","Männer","Frauen","Frauen","Frauen","Frauen","Frauen","Frauen","Männer","Männer","Männer","Männer","Frauen","Frauen","Frauen","Frauen","Frauen","Frauen","Männer","Männer","Männer","Männer",null,"Frauen","Frauen","Frauen","Männer","Männer","Frauen","Frauen","Frauen","Männer","Männer","Frauen","Frauen","Frauen","Männer","Männer"]
[null,"Tab/DS","Anzahl","VJM","Anteil der\nPersonen-\ngruppe an\nInsgesamt\nin %","Verände-\nrung zum\nVorjahr\nin %","Gesamt","Anteil an\nFrauen\nund Männer\ninsgesamt\nin %","Anzahl","VJM","Anteil der\nPersonen-\ngruppe an\nInsgesamt\nin %","Verände-\nrung zum\nVorjahr\nin %","Anzahl","VJM","Anteil der\nPersonen-\ngruppe an\nInsgesamt\nin %","Verände-\nrung zum\nVorjahr\nin %","Gesamt","Anteil an\nFrauen\nund Männer\ninsgesamt\nin %","Anzahl","VJM","Anteil der\nPersonen-\ngruppe an\nInsgesamt\nin %","Verände-\nrung zum\nVorjahr\nin %","Anzahl","VJM","Anteil der\nPersonen-\ngruppe an\nInsgesamt\nin %","Verände-\nrung zum\nVorjahr\nin %","Gesamt","Anteil an\nFrauen\nund Männer\ninsgesamt\nin %","Anzahl","VJM","Anteil der\nPersonen-\ngruppe an\nInsgesamt\nin %","Verände-\nrung zum\nVorjahr\nin %",null,"Anteil der\nPersonen-\ngruppe an\nInsgesamt\nin %","Verände-\nrung zum\nVorjahr\nin %","Anteil an\nFrauen\nund Männer\ninsgesamt\nin %","Anteil der\nPersonen-\ngruppe an\nInsgesamt\nin %","Verände-\nrung zum\nVorjahr\nin %","Anteil der\nPersonen-\ngruppe an\nInsgesamt\nin %","Verände-\nrung zum\nVorjahr\nin %","Anteil an\nFrauen\nund Männer\ninsgesamt\nin %","Anteil der\nPersonen-\ngruppe an\nInsgesamt\nin %","Verände-\nrung zum\nVorjahr\nin %","Anteil der\nPersonen-\ngruppe an\nInsgesamt\nin %","Verände-\nrung zum\nVorjahr\nin %","Anteil an\nFrauen\nund Männer\ninsgesamt\nin %","Anteil der\nPersonen-\ngruppe an\nInsgesamt\nin %","Verände-\nrung zum\nVorjahr\nin %"]
[null,null,1,0,2,3,0,4,5,0,6,7,1,0,2,3,0,4,5,0,6,7,1,0,2,3,0,4,5,0,6,7,null,2,3,4,6,7,2,3,4,6,7,2,3,4,6,7]
[null,null,1,2,3,4,5,6,7,8,9,10,1,2,3,4,5,6,7,8,9,10,1,2,3,4,5,6,7,8,9,10,null,3,4,6,9,10,3,4,6,9,10,3,4,6,9,10]
[null,null,"1Insgesamt","2Insgesamt",null,null,"5Insgesamt",null,"7Insgesamt","8Insgesamt",null,null,"1SGB III","2SGB III",null,null,"5SGB III",null,"7SGB III","8SGB III",null,null,"1SGB II","2SGB II",null,null,"5SGB II",null,"7SGB II","8SGB II",null,null,null,"3Insgesamt","4Insgesamt","6Insgesamt","9Insgesamt","10Insgesamt","3SGB III","4SGB III","6SGB III","9SGB III","10SGB III","3SGB II","4SGB II","6SGB II","9SGB II","10SGB II"]
[null,"ID für Auswahl","Insgesamt",null,null,null,null,null,null,null,null,null,"SGB III",null,null,null,null,null,null,null,null,null,"SGB II"]
[null,null,238322,290411,null,null,524589,null,286263,353139,null,null,135779,143026,null,null,302960,null,167177,172087,null,null,102543,147385,null,null,221629,null,119086,181052,null,null,null,100,-17.93630406561735,45.430232048327355,100,-18.937585483336587,100,-5.0669109113028403,44.817467652495381,100,-2.8532079703870719,100,-30.425077178817382,46.267862057763196,100,-34.22552636811524]
[null,null,237,0,null,null,505,null,268,0,null,null,0,0,null,null,0,null,0,0,null,null,237,0,null,null,505,null,268,0]
[null,1,87521,95026,null,null,202419,null,114898,127255,null,null,73839,77606,null,null,165980,null,92141,95816,null,null,13682,17420,null,null,36439,null,22757,31439,null,null,null,36.723844210773663,-7.8978384863090101,43.237541930352386,40.137216475758308,-9.7104239519075879,54.38175270108043,-4.8540061335463749,44.486685142788289,55.115835312273816,-3.8354763296317942,13.342695259549654,-21.458094144661306,37.547682428167626,19.109719026585829,-27.615382168644043]
[null,1,80767,86306,null,null,186807,null,106040,115440,null,null,70647,74017,null,null,159300,null,88653,91876,null,null,10120,12289,null,null,27507,null,17387,23564,null,null,null,33.889863294198605,-6.4178620258151229,43.23553185908451,37.042859188927665,-8.1427581427581419,52.030873699172922,-4.5530080927354524,44.348399246704332,53.029423904005938,-3.5079890286908446,9.8690305530362874,-17.649930832451783,36.790635111062635,14.600372839796449,-26.213715837718553]
[null,1,2855,2922,null,null,6525,null,3670,4238,null,null,2296,2322,null,null,4922,null,2626,2801,null,null,559,600,null,null,1603,null,1044,1437,null,null,null,1.1979590637876485,-2.2929500342231348,43.754789272030656,1.2820378463161499,-13.402548371873523,1.6909831417229471,-1.119724375538329,46.647704185290536,1.5707902402842495,-6.2477686540521242,0.54513716197107553,-6.833333333333333,34.872114784778539,0.87667735921938772,-27.348643006263046]
[null,1,77720,86776,null,null,175552,null,97829,112536,null,null,39659,36497,null,null,89820,null,50158,44771,null,null,38061,50279,null,null,85732,null,47671,67765,null,null,null,32.61134095887077,-10.436065271503642,44.271782719650012,34.174517838491177,-13.068706902680031,29.208493213236213,8.6637257856810148,44.153863282119794,30.002931025200834,12.032342364477005,37.11711184576226,-24.300403747091231,44.395324966173654,40.030734091328959,-29.65247546668634]
[null,1,62723,99023,null,null,125152,null,62429,102702,null,null,20655,27615,null,null,43864,null,23209,30295,null,null,42068,71408,null,null,81288,null,39220,72407,null,null,null,26.318594170911624,-36.658150126738235,50.117457172078751,21.808267222798616,-39.213452513096144,15.21221985726806,-25.203693644758285,47.088728798103233,13.88289058901643,-23.389998349562635,41.024740840427917,-41.087833295989249,51.751796083062693,32.934182019716843,-45.833966329222314]
[null,1,10358,9586,null,null,21466,null,11107,10646,null,null,1626,1308,null,null,3296,null,1669,1205,null,null,8732,8278,null,null,18170,null,9438,9441,null,null,null,4.3462206594439463,8.0534112247026926,48.253051336998041,3.8799984629519009,4.3302648882209285,1.1975342284152926,24.311926605504588,49.332524271844655,0.99834307350891582,38.506224066390047,8.5154520542601642,5.484416525730853,48.057237204182719,7.9253648623683723,-3.1776294884016523E-2]
[null,null,208891,263206,null,null,479119,null,270225,336402,null,null,112299,125601,null,null,259354,null,147052,156464,null,null,96592,137605,null,null,219765,null,123173,179938,null,null,null,100,-20.635927752406861,43.598980629029533,100,-19.671999571940713,100,-10.590680010509471,43.299505694918913,100,-6.0154412516617235,100,-29.804876276298099,43.952403703956499,100,-31.546977292178418]
[null,null,154,0,null,null,359,null,205,0,null,null,0,0,null,null,0,null,0,0,null,null,154,0,null,null,359,null,205,0]
[null,1,73886,75516,null,null,179669,null,105783,106514,null,null,58339,55669,null,null,135458,null,77119,68741,null,null,15547,19847,null,null,44211,null,28664,37773,null,null,null,35.370599977978948,-2.1584829704963187,41.1233991395288,39.146266999722449,-0.68629475937435447,51.949705696399796,4.7962061470477284,43.06796202512956,52.443353371596444,12.187777309029546,16.095535862183201,-21.665742933440825,35.165456560584467,23.271333815040634,-24.11510867550896]
[null,1,66987,67824,null,null,161902,null,94915,94253,null,null,54816,52400,null,null,127061,null,72245,64175,null,null,12171,15424,null,null,34841,null,22670,30078,null,null,null,32.067920590164249,-1.2340764331210192,41.375029338735779,35.124433342584879,0.7023649114617041,48.812545080543906,4.6106870229007635,43.141483224592911,49.128879580012516,12.574990261005064,12.600422395229419,-21.090508298755186,34.932981257713614,18.405007590949314,-24.629297160715474]
[null,1,3869,3570,null,null,9662,null,5793,5430,null,null,3323,3099,null,null,7960,null,4637,4315,null,null,546,471,null,null,1702,null,1156,1115,null,null,null,1.852162132403981,8.3753501400560211,40.043469261022565,2.1437690813211212,6.6850828729281773,2.9590646399344607,7.2281381090674408,41.746231155778894,3.1533063134129424,7.4623406720741592,0.56526420407487166,15.923566878980891,32.07990599294947,0.93851736987813883,3.6771300448430493]
[null,1,53104,64888,null,null,129215,null,76110,93927,null,null,23608,27131,null,null,57185,null,33576,36143,null,null,29496,37757,null,null,72030,null,42534,57784,null,null,null,25.421870736412771,-18.160522746886944,41.097395813179581,28.165417707466002,-18.968986553387204,21.022448997764894,-12.985146142788691,41.283553379382703,22.832739439109975,-7.1023434689981455,30.536690409143613,-21.879386603808566,40.949604331528526,34.531918521104465,-26.391388619687113]
[null,1,64616,105391,null,null,134667,null,70050,116863,null,null,27988,40364,null,null,61237,null,33248,48221,null,null,36628,65027,null,null,73430,null,36802,68642,null,null,null,30.932878869841208,-38.689261891432849,47.982059450347897,25.922842076047736,-40.058016651977098,24.922750870444084,-30.660985036170846,45.704394402077178,22.609689089573756,-31.050787001513864,37.920324664568497,-43.672628292862967,49.881519814789591,29.878301251085869,-46.385594825325605]
[null,1,17285,17411,null,null,35568,null,18282,19098,null,null,2364,2437,null,null,5474,null,3109,3359,null,null,14921,14974,null,null,30094,null,15173,15739,null,null,null,8.2746504157670753,-0.72368043191086096,48.597053531264059,6.7654732167638079,-4.2726987119070063,2.1050944353912326,-2.9954862535904803,43.185970040189993,2.1142180997198268,-7.4426912771658236,15.447449064104687,-0.35394684119139841,49.581311889413172,12.318446412769033,-3.596162399135904]
[]
[]
[null,"DiaDatRoh"]
[]
[]
[]
[null,null,null,null,"ID",null,"2018-08-01","2018-09-01","Okt 2018","2018-11-01","Dez 2018","2019-01-01","2019-02-01","2019-03-01","2019-04-01","Mai 2019","2019-06-01","2019-07-01","2019-08-01","2019-09-01","Okt 2019","2019-11-01","Dez 2019","2020-01-01","2020-02-01","2020-03-01","2020-04-01","Mai 2020","2020-06-01","2020-07-01","2020-08-01"]
[null,"X","Abg","G","Insgesamt",null,1761,3278,2164,1903,186,669,815,941,1074,0,0,0,0,0,0,0,0,314,381,91,52,0,130,527,359]
[null,"Insgesamt","Abg","F","Insgesamt",null,69223,81613,69342,68147,55777,56411,65684,71252,76202,66035,58657,55180,67824,81551,72241,64179,53435,54662,63996,70464,46598,42778,58769,54295,66987]
[null,"Insgesamt","Abg","M","Insgesamt",null,95119,98188,91573,89881,75489,74692,97595,127919,131303,103016,91362,86006,94253,97885,95620,85141,73078,73343,100048,123922,83335,71627,82861,84291,94915]
[null,"X","Abg","G","SGB III",null,0,0,0,0,0,0,0,0,0,0,0,0,0,0,0,0,0,0,0,0,0,0,0,0,0]
[null,"Insgesamt","Abg","F","SGB III",null,52599,62517,51427,50575,40255,43912,51219,56154,59629,50490,43404,41264,52400,63081,54619,48228,39098,43123,50778,56092,37408,34793,48378,43602,54816]
[null,"Insgesamt","Abg","M","SGB III",null,62296,65077,59243,58568,47948,53791,72113,99592,99128,72543,60556,56428,64175,67388,64364,57752,48521,54324,76228,96618,66073,56702,64006,63228,72245]
[null,"X","Abg","G","SGB II",null,1761,3278,2164,1903,186,669,815,941,1074,0,0,0,0,0,0,0,0,314,381,91,52,0,130,527,359]
[null,"Insgesamt","Abg","F","SGB II",null,16624,19096,17915,17572,15522,12499,14465,15098,16573,15545,15253,13916,15424,18470,17622,15951,14337,11539,13218,14372,9190,7985,10391,10693,12171]
[null,"Insgesamt","Abg","M","SGB II",null,32823,33111,32330,31313,27541,20901,25482,28327,32175,30473,30806,29578,30078,30497,31256,27389,24557,19019,23820,27304,17262,14925,18855,21063,22670]
[]
[null,null,null,null,null,null,"2018-07-01","2018-08-01","2018-09-01","Okt 2018","2018-11-01","Dez 2018","2019-01-01","2019-02-01","2019-03-01","2019-04-01","Mai 2019","2019-06-01","2019-07-01","2019-08-01","2019-09-01","Okt 2019","2019-11-01","Dez 2019","2020-01-01","2020-02-01","2020-03-01","2020-04-01","Mai 2020","2020-06-01","2020-07-01"]
[null,"X","Bst","G","Insgesamt",null,3914,10707,10969,3676,1139,1135,4189,0,3804,0,0,0,0,0,0,0,0,0,3818,0,626,0,0,2453,5274]
[null,"Insgesamt","Bst","F","Insgesamt",null,1058128,1075905,1028845,1001403,987301,984864,1046879,1023769,1002591,982859,992681,987831,1023140,1050360,1005126,987976,967567,975181,1039335,1020967,1000686,1145947,1224064,1243824,1275614]
[null,"Insgesamt","Bst","M","Insgesamt",null,1266617,1274969,1227624,1202445,1198806,1224682,1358706,1348930,1298528,1246013,1243285,1228409,1252316,1269045,1228900,1216110,1212429,1251971,1386183,1374634,1334677,1497788,1588912,1609473,1634377]
[null,"X","Bst","G","SGB III",null,0,0,0,0,0,0,0,0,0,0,0,0,0,0,0,0,0,0,0,0,0,0,0,0,0]
[null,"Insgesamt","Bst","F","SGB III",null,362812,373714,349782,339865,337142,341532,382881,372586,357608,343866,336810,335788,366559,380778,357752,348778,345289,352891,395981,387503,373634,455351,494400,504494,534521]
[null,"Insgesamt","Bst","M","SGB III",null,425138,430227,409543,402418,407456,435312,536375,535068,492170,450912,435503,430154,458062,467347,450343,446202,454281,485470,588582,583488,551240,637217,677930,692474,723946]
[null,"X","Bst","G","SGB II",null,3914,10707,10969,3676,1139,1135,4189,0,3804,0,0,0,0,0,0,0,0,0,3818,0,626,0,0,2453,5274]
[null,"Insgesamt","Bst","F","SGB II",null,695316,702191,679063,661538,650159,643332,663998,651183,644983,638993,655871,652043,656581,669582,647374,639198,622278,622290,643354,633464,627052,690596,729664,739330,741093]
[null,"Insgesamt","Bst","M","SGB II",null,841479,844742,818081,800027,791350,789370,822331,813862,806358,795101,807782,798255,794254,801698,778557,769908,758148,766501,797601,791146,783437,860571,910982,916999,910431]
[]
[]
[]
[null,"TabAusw","Frauen","Frauen","Frauen","Frauen","Männer","Männer","Männer"]
[null,null,"Zugang/\nAbgang","Anteil der\nMerkmals-\ngruppe an\nInsgesamt\nin %","Verände-\nrung zum\nVorjahr\nin %","Anteil an\nallen Personen\nin %","Zugang/\nAbgang","Anteil der\nMerkmals-\ngruppe an\nInsgesamt\nin %","Verände-\nrung zum\nVorjahr\nin %"]
[null,null,1,2,3,4,5,6,7]
[null,{"$f":"Auswahl!$A$2","v":"Insgesamt"},1,3,4,6,7,9,10,"Spalte in der Tabelle Tab/DS für Insgesamt"]
[null,null,{"$f":"MATCH(C64&$B$64,$C$13:$AV$13,0)","v":1},{"$f":"MATCH(D64&$B$64,$C$13:$AV$13,0)","v":32},33,34,7,35,36,"ID"]
[1,"Insgesamt",{"$f":"INDEX($C$15:$AV$30,$A66,C$65)","v":238322},100,-17.93630406561735,45.430232048327355,286263,100,-18.937585483336587]
[3,"Erwerbstätigkeit",87521,36.723844210773663,-7.8978384863090101,43.237541930352386,114898,40.137216475758308,-9.7104239519075879]
[4,"dar. Beschäftigung am 1. Arbeitsmarkt",80767,33.889863294198605,-6.4178620258151229,43.23553185908451,106040,37.042859188927665,-8.1427581427581419]
[5,"Selbständigkeit",2855,1.1979590637876485,-2.2929500342231348,43.754789272030656,3670,1.2820378463161499,-13.402548371873523]
[6,"Ausbildung u. sonst. Maßnahmeteilnahme",77720,32.61134095887077,-10.436065271503642,44.271782719650012,97829,34.174517838491177,-13.068706902680031]
[7,"Nichterwerbstätigkeit",62723,26.318594170911624,-36.658150126738235,50.117457172078751,62429,21.808267222798616,-39.213452513096144]
[8,"Sonstiges/ Keine Angabe",10358,4.3462206594439463,8.0534112247026926,48.253051336998041,11107,3.8799984629519009,4.3302648882209285]
[9,"Insgesamt",208891,100,-20.635927752406861,43.598980629029533,270225,100,-19.671999571940713]
[11,"Erwerbstätigkeit",73886,35.370599977978948,-2.1584829704963187,41.1233991395288,105783,39.146266999722449,-0.68629475937435447]
[12,"dar. Beschäftigung am 1. Arbeitsmarkt",66987,32.067920590164249,-1.2340764331210192,41.375029338735779,94915,35.124433342584879,0.7023649114617041]
[13,"Selbständigkeit",3869,1.852162132403981,8.3753501400560211,40.043469261022565,5793,2.1437690813211212,6.6850828729281773]
[14,"Ausbildung u. sonst. Maßnahmeteilnahme",53104,25.421870736412771,-18.160522746886944,41.097395813179581,76110,28.165417707466002,-18.968986553387204]
[15,"Nichterwerbstätigkeit",64616,30.932878869841208,-38.689261891432849,47.982059450347897,70050,25.922842076047736,-40.058016651977098]
[16,"Sonstiges/ Keine Angabe",17285,8.2746504157670753,-0.72368043191086096,48.597053531264059,18282,6.7654732167638079,-4.2726987119070063]
[]
[]
[null,"Berechnung Dia"]
[null,null,null,null,null,null,{"$f":"TEXT(G37,\"MMM JJJJ\")","v":"Aug 2018"},{"$f":"TEXT(H37,\"MMM JJJJ\")","v":"Sep 2018"},"Okt 2018","Nov 2018","Dez 2018","Jan 2019","Feb 2019","Mrz 2019","Apr 2019","Mai 2019","Jun 2019","Jul 2019","Aug 2019","Sep 2019","Okt 2019","Nov 2019","Dez 2019","Jan 2020","Feb 2020","Mrz 2020","Apr 2020","Mai 2020","Jun 2020","Jul 2020","Aug 2020"]
[null,"Insgesamt","F","Insgesamt","InsgesamtFInsgesamt",{"$f":"$C$8","v":1},{"$f":"IF(AND($F84=0,OR(G$38>0,G$49>0)),#N/A,G39/G50*100)","v":6.5420251614171452},{"$f":"IF(AND($F84=0,OR(H$38>0,H$49>0)),#N/A,H39/H50*100)","v":7.5855210264846802},6.7397907362139104,6.8051523712231736,5.6494422673531171,5.727795919030445,6.2742685639887705,6.9597731519512704,7.6005070861398112,6.7186646304302045,5.9089475873921229,5.5859757387650317,6.6290048282737448,7.7640999276438558,7.187258114903007,6.4960080001943368,5.5226149713663242,5.6053183973026544,6.1573987212977528,6.9016922192392114,4.6566055685799546,3.7329824154171178,4.8011378490013596,4.3651674191847079,{"$f":"IF(AND($F84=0,OR(AE$38>0,AE$49>0)),#N/A,AE39/AE50*100)","v":5.2513534658603627},{"$f":"COUNTIF(G84:AE84,#N/A)","v":0}]
[null,"Insgesamt","M","Insgesamt","InsgesamtMInsgesamt",1,{"$f":"IF(AND($F85=0,OR(G$38>0,G$49>0)),#N/A,G40/G51*100)","v":7.5096891957079377},7.7012068528725015,7.4593686666275669,7.4748533196944562,6.2970155304527999,6.0988893443359169,7.1829372947495624,9.4829976351626843,10.111680302619581,8.2676504980285124,7.3484357971020318,7.0014140241564498,7.526295280105022,7.7132804589277768,7.7809423061274305,7.0010936510677482,6.0274044913145426,5.8582027858472756,7.217517456208884,9.0149086956964535,6.2438327775184561,4.7821854628291849,5.2149521181789806,5.2371801204493647,{"$f":"IF(AND($F85=0,OR(AE$38>0,AE$49>0)),#N/A,AE40/AE51*100)","v":5.8074116314656896},{"$f":"COUNTIF(G85:AE85,#N/A)","v":0}]
[null,"Insgesamt","F","SGB III","InsgesamtFSGB III",1,{"$f":"IF(AND($F86=0,OR(G$41>0,G$52>0)),#N/A,G42/G53*100)","v":14.497591038885153},16.728567835296509,14.702586182250659,14.8809085960602,11.940072728998462,12.857360364475365,13.377263431718994,15.07141975275507,16.674403257197827,14.683045139676501,12.88679077224548,12.288705969242498,14.295106654044778,16.566345744764664,15.267280127015361,13.827707022805338,11.323268334641416,12.219920598711784,12.823342534111484,14.47524277231402,10.011936815172067,7.6409187637668516,9.7851941747572813,8.6427192394755927,{"$f":"IF(AND($F86=0,OR(AE$41>0,AE$52>0)),#N/A,AE42/AE53*100)","v":10.255163033819064},0]
[null,"Insgesamt","M","SGB III","InsgesamtMSGB III",1,{"$f":"IF(AND($F87=0,OR(G$41>0,G$52>0)),#N/A,G43/G54*100)","v":14.653124397254539},15.126200819567345,14.465636087053129,14.554020943397164,11.767650985627895,12.35688425772779,13.444511768818456,18.612961343231142,20.141008188227644,16.088061528635301,13.904841068833051,13.118092590095639,14.01011216822177,14.419264486559239,14.292217265506512,12.943016839906591,10.680834109284781,11.189980843306486,12.951126605978436,16.558695294504773,11.986249183658661,8.8983815560476263,9.4413877538978959,9.1307399266976095,{"$f":"IF(AND($F87=0,OR(AE$41>0,AE$52>0)),#N/A,AE43/AE54*100)","v":9.9793354752978818},0]
[null,"Insgesamt","F","SGB II","InsgesamtFSGB II",1,{"$f":"IF(AND($F88=0,OR(G$44>0,G$55>0)),#N/A,G45/G56*100)","v":2.3908553808628019},2.7194880025520121,2.6381940998110633,2.6562344113263334,2.387416001316601,1.9428537675725752,2.1784704170795695,2.3185494707324978,2.56952508825814,2.4327340049108517,2.3256097616756954,2.1342150747726758,2.3491389485836476,2.7584373534533486,2.7220741024508244,2.495470886955216,2.3039541812501807,1.8542801587684197,2.0545453980234831,2.2687950696487884,1.4655881808845199,1.1562476469600171,1.4240801245504779,1.4463094964359622,{"$f":"IF(AND($F88=0,OR(AE$44>0,AE$55>0)),#N/A,AE45/AE56*100)","v":1.642304002331691},0]
[null,"Insgesamt","M","SGB II","InsgesamtMSGB II",1,{"$f":"IF(AND($F89=0,OR(G$44>0,G$55>0)),#N/A,G46/G57*100)","v":3.9006321013358622},3.9196583098744942,3.9519314102148808,3.9139929027395324,3.4802552599987364,2.6478077454172313,3.0987522056203645,3.4805655012766294,3.9901631781417186,3.832594852729402,3.8136526934247112,3.7053322559833637,3.7869497666993177,3.8040509019605886,4.0146065092215473,3.5574380315570169,3.2390773305475977,2.4812753016630116,2.9864556338319534,3.4511961129804107,2.2033679798120334,1.7343136127059824,2.0697445174547906,2.2969490697372623,{"$f":"IF(AND($F89=0,OR(AE$44>0,AE$55>0)),#N/A,AE46/AE57*100)","v":2.4900294475913056},{"$f":"COUNTIF(G89:AE89,#N/A)","v":0}]
[]
[]
[null,"DiaDat_einfach",null,null,null,null,{"$f":"G94*1","v":43313},{"$f":"H94*1","v":43344},43374,43405,43435,43466,43497,43525,43556,43586,43617,43647,43678,43709,43739,43770,43800,43831,43862,43891,43922,43952,43983,44013,44044]
[null,null,null,null,null,null,3,4,5,6,7,8,9,10,11,12,13,14,15,16,17,18,19,20,21,22,23,24,25,26,27]
[null,null,null,null,null,null,{"$f":"TEXT(G83,\"MMM JJJJ\")","v":"Aug 2018"},{"$f":"TEXT(H83,\"MMM JJJJ\")","v":"Sep 2018"},"Okt 2018","Nov 2018","Dez 2018","Jan 2019","Feb 2019","Mrz 2019","Apr 2019","Mai 2019","Jun 2019","Jul 2019","Aug 2019","Sep 2019","Okt 2019","Nov 2019","Dez 2019","Jan 2020","Feb 2020","Mrz 2020","Apr 2020","Mai 2020","Jun 2020","Jul 2020","Aug 2020","max"]
[null,"Insgesamt","F",{"$f":"$B$64","v":"Insgesamt"},{"$f":"B95&C95&D95","v":"InsgesamtFInsgesamt"},null,{"$f":"VLOOKUP($E95,$E$84:$AE$89,G$93,0)","v":6.5420251614171452},{"$f":"VLOOKUP($E95,$E$84:$AE$89,H$93,0)","v":7.5855210264846802},6.7397907362139104,6.8051523712231736,5.6494422673531171,5.727795919030445,6.2742685639887705,6.9597731519512704,7.6005070861398112,6.7186646304302045,5.9089475873921229,{"$f":"VLOOKUP($E95,$E$84:$AE$89,R$93,0)","v":5.5859757387650317},6.6290048282737448,7.7640999276438558,7.187258114903007,6.4960080001943368,5.5226149713663242,5.6053183973026544,6.1573987212977528,6.9016922192392114,4.6566055685799546,3.7329824154171178,4.8011378490013596,4.3651674191847079,5.2513534658603627,{"$f":"MAX(G95:AE96)","v":10.111680302619581}]
[null,"Insgesamt","M",{"$f":"$B$64","v":"Insgesamt"},{"$f":"B96&C96&D96","v":"InsgesamtMInsgesamt"},null,{"$f":"VLOOKUP($E96,$E$84:$AE$89,G$93,0)","v":7.5096891957079377},7.7012068528725015,7.4593686666275669,7.4748533196944562,6.2970155304527999,6.0988893443359169,7.1829372947495624,9.4829976351626843,10.111680302619581,8.2676504980285124,7.3484357971020318,7.0014140241564498,7.526295280105022,7.7132804589277768,7.7809423061274305,7.0010936510677482,6.0274044913145426,5.8582027858472756,7.217517456208884,9.0149086956964535,6.2438327775184561,4.7821854628291849,5.2149521181789806,5.2371801204493647,5.8074116314656896]
[]
[null,"Datenbeschriftung DS"]
[null,null,null,null,null,null,{"$f":"TEXT(G94,\"MMM JJJJ\")","v":"Aug 2018"},{"$f":"TEXT(H94,\"MMM JJJJ\")","v":"Sep 2018"},"Okt 2018","Nov 2018","Dez 2018","Jan 2019","Feb 2019","Mrz 2019","Apr 2019","Mai 2019","Jun 2019","Jul 2019","Aug 2019","Sep 2019","Okt 2019","Nov 2019","Dez 2019","Jan 2020","Feb 2020","Mrz 2020","Apr 2020","Mai 2020","Jun 2020","Jul 2020","Aug 2020"]
[null,"Insgesamt","F",{"$f":"$B$64","v":"Insgesamt"},{"$f":"B100&C100&D100","v":"InsgesamtFInsgesamt"},null,{"$f":"IFERROR(G95,\"X\")","v":6.5420251614171452},{"$f":"IFERROR(H95,\"\")","v":7.5855210264846802},6.7397907362139104,6.8051523712231736,5.6494422673531171,5.727795919030445,6.2742685639887705,6.9597731519512704,7.6005070861398112,6.7186646304302045,5.9089475873921229,5.5859757387650317,6.6290048282737448,7.7640999276438558,7.187258114903007,6.4960080001943368,5.5226149713663242,5.6053183973026544,6.1573987212977528,6.9016922192392114,4.6566055685799546,3.7329824154171178,4.8011378490013596,4.3651674191847079,5.2513534658603627]
[null,"Insgesamt","M",{"$f":"$B$64","v":"Insgesamt"},{"$f":"B101&C101&D101","v":"InsgesamtMInsgesamt"},null,{"$f":"IFERROR(G96,\"X\")","v":7.5096891957079377},{"$f":"IFERROR(H96,\"\")","v":7.7012068528725015},7.4593686666275669,7.4748533196944562,6.2970155304527999,6.0988893443359169,7.1829372947495624,9.4829976351626843,10.111680302619581,8.2676504980285124,7.3484357971020318,7.0014140241564498,7.526295280105022,7.7132804589277768,7.7809423061274305,7.0010936510677482,6.0274044913145426,5.8582027858472756,7.217517456208884,9.0149086956964535,6.2438327775184561,4.7821854628291849,5.2149521181789806,5.2371801204493647,5.8074116314656896]
[]
[null,"Text bei unvollständiger Datenlieferung",null,null,null,"Zählt Datenausfälle",null,{"$f":"SUMIF($E$84:$E$89,I103,AF84:AF89)","v":0},{"$f":"E95","v":"InsgesamtFInsgesamt"}]
[null,{"$f":"IF(H103>0,B105,\"\")","v":""}]
[null,"Lücken in der Grafik entstehen durch unvollständige Daten. Strukturen für Abgänge können dann nicht ausgewertet werden."]
[null,null,null,null,null,null,{"$f":"G100","v":6.5420251614171452},{"$f":"H100","v":7.5855210264846802},6.7397907362139104,6.8051523712231736,5.6494422673531171,5.727795919030445,6.2742685639887705,6.9597731519512704,7.6005070861398112,6.7186646304302045,5.9089475873921229,5.5859757387650317,6.6290048282737448,7.7640999276438558,7.187258114903007,6.4960080001943368,5.5226149713663242,5.6053183973026544,6.1573987212977528,6.9016922192392114,4.6566055685799546,3.7329824154171178,4.8011378490013596,4.3651674191847079,5.2513534658603627]
[null,null,null,null,null,null,{"$f":"G101","v":7.5096891957079377},7.7012068528725015,7.4593686666275669,7.4748533196944562,6.2970155304527999,6.0988893443359169,7.1829372947495624,9.4829976351626843,10.111680302619581,8.2676504980285124,7.3484357971020318,7.0014140241564498,7.526295280105022,7.7132804589277768,7.7809423061274305,7.0010936510677482,6.0274044913145426,5.8582027858472756,7.217517456208884,9.0149086956964535,6.2438327775184561,4.7821854628291849,5.2149521181789806,5.2371801204493647,5.8074116314656896]
[null,null,null,null,null,null,null,null,null,null,null,null,null,null,null,null,null,null,null,null,null,null,null,null,null,null,null,{"$f":"IF(COUNTIF(AC108:AE108,\"\")=3,\"Frauen\",\"\")","v":""},{"$f":"IF(COUNTIF(AD108:AE108,\"\")=2,\"Frauen\",\"\")","v":""},{"$f":"IF(AE108<>\"\",\"\",\"Frauen\")","v":""},{"$f":"IF(AE100=\"\",\"\",\"Frauen\")","v":"Frauen"}]
[null,"Die Abgangsrate ist der Anteil des Abgangs Arbeitsoser eines Monats zum Bestand Arbeitsloser des Vormonats.",null,null,null,null,null,null,null,null,null,null,null,null,null,null,null,null,null,null,null,null,null,null,null,null,null,{"$f":"IF(COUNTIF(AC109:AE109,\"\")=3,\"Männer\",\"\")","v":""},{"$f":"IF(COUNTIF(AD109:AE109,\"\")=2,\"Männer\",\"\")","v":""},{"$f":"IF(AE109<>\"\",\"\",\"Männer\")","v":""},{"$f":"IF(AE101=\"\",\"\",\"Männer\")","v":"Männer"}]
[]
[null,"DiaDat"]
[null,null,"'Tab 1.2_roh'!$AL$112:$BJ$112",1,"Frauen","d01_F",{"$f":"G95","v":6.5420251614171452},{"$f":"H95","v":7.5855210264846802}]
[null,null,"'Tab 1.2_roh'!$AL$113:$BJ$113",2,null,"d02_F",null,{"$f":"H95:I95","v":7.5855210264846802},{"$f":"I95:J95","v":6.7397907362139104}]
[null,null,"'Tab 1.2_roh'!$AL$114:$BJ$114",3,null,"d03_F",null,null,{"$f":"I95","v":6.7397907362139104},{"$f":"J95","v":6.8051523712231736}]
[null,null,"'Tab 1.2_roh'!$AL$115:$BJ$115",4,null,"d04_F",null,null,null,{"$f":"J95","v":6.8051523712231736},{"$f":"K95","v":5.6494422673531171}]
[null,null,"'Tab 1.2_roh'!$AL$116:$BJ$116",5,null,"d05_F",null,null,null,null,{"$f":"K95","v":5.6494422673531171},{"$f":"L95","v":5.727795919030445}]
[null,null,"'Tab 1.2_roh'!$AL$117:$BJ$117",6,null,"d06_F",null,null,null,null,null,{"$f":"L95","v":5.727795919030445},{"$f":"M95","v":6.2742685639887705}]
[null,null,"'Tab 1.2_roh'!$AL$118:$BJ$118",7,null,"d07_F",null,null,null,null,null,null,{"$f":"M95","v":6.2742685639887705},{"$f":"N95","v":6.9597731519512704}]
[null,null,"'Tab 1.2_roh'!$AL$119:$BJ$119",8,null,"d08_F",null,null,null,null,null,null,null,{"$f":"N95","v":6.9597731519512704},{"$f":"O95","v":7.6005070861398112}]
[null,null,"'Tab 1.2_roh'!$AL$120:$BJ$120",9,null,"d09_F",null,null,null,null,null,null,null,null,{"$f":"O95","v":7.6005070861398112},{"$f":"P95","v":6.7186646304302045}]
[null,null,"'Tab 1.2_roh'!$AL$121:$BJ$121",10,null,"d10_F",null,null,null,null,null,null,null,null,null,{"$f":"P95","v":6.7186646304302045},{"$f":"Q95","v":5.9089475873921229}]
[null,null,"'Tab 1.2_roh'!$AL$122:$BJ$122",11,null,"d11_F",null,null,null,null,null,null,null,null,null,null,{"$f":"Q95","v":5.9089475873921229},{"$f":"R95","v":5.5859757387650317}]
[null,null,"'Tab 1.2_roh'!$AL$123:$BJ$123",12,null,"d12_F",null,null,null,null,null,null,null,null,null,null,null,{"$f":"R95","v":5.5859757387650317},{"$f":"S95","v":6.6290048282737448}]
[null,null,"'Tab 1.2_roh'!$AL$124:$BJ$124",13,null,"d13_F",null,null,null,null,null,null,null,null,null,null,null,null,{"$f":"S95","v":6.6290048282737448},{"$f":"T95","v":7.7640999276438558}]
[null,null,"'Tab 1.2_roh'!$AL$125:$BJ$125",14,null,"d14_F",null,null,null,null,null,null,null,null,null,null,null,null,null,{"$f":"T95","v":7.7640999276438558},{"$f":"U95","v":7.187258114903007}]
[null,null,"'Tab 1.2_roh'!$AL$126:$BJ$126",15,null,"d15_F",null,null,null,null,null,null,null,null,null,null,null,null,null,null,{"$f":"U95","v":7.187258114903007},{"$f":"V95","v":6.4960080001943368}]
[null,null,"'Tab 1.2_roh'!$AL$127:$BJ$127",16,null,"d16_F",null,null,null,null,null,null,null,null,null,null,null,null,null,null,null,{"$f":"V95","v":6.4960080001943368},{"$f":"W95","v":5.5226149713663242}]
[null,null,"'Tab 1.2_roh'!$AL$128:$BJ$128",17,null,"d17_F",null,null,null,null,null,null,null,null,null,null,null,null,null,null,null,null,{"$f":"W95","v":5.5226149713663242},{"$f":"X95","v":5.6053183973026544}]
[null,null,"'Tab 1.2_roh'!$AL$129:$BJ$129",18,null,"d18_F",null,null,null,null,null,null,null,null,null,null,null,null,null,null,null,null,null,{"$f":"X95","v":5.6053183973026544},{"$f":"Y95","v":6.1573987212977528}]
[null,null,"'Tab 1.2_roh'!$AL$130:$BJ$130",19,null,"d19_F",null,null,null,null,null,null,null,null,null,null,null,null,null,null,null,null,null,null,{"$f":"Y95","v":6.1573987212977528},{"$f":"Z95","v":6.9016922192392114}]
[null,null,"'Tab 1.2_roh'!$AL$131:$BJ$131",20,null,"d20_F",null,null,null,null,null,null,null,null,null,null,null,null,null,null,null,null,null,null,null,{"$f":"Z95","v":6.9016922192392114},{"$f":"AA95","v":4.6566055685799546}]
[null,null,"'Tab 1.2_roh'!$AL$132:$BJ$132",21,null,"d21_F",null,null,null,null,null,null,null,null,null,null,null,null,null,null,null,null,null,null,null,null,{"$f":"AA95","v":4.6566055685799546},{"$f":"AB95","v":3.7329824154171178}]
[null,null,"'Tab 1.2_roh'!$AL$133:$BJ$133",22,null,"d22_F",null,null,null,null,null,null,null,null,null,null,null,null,null,null,null,null,null,null,null,null,null,{"$f":"AB95","v":3.7329824154171178},{"$f":"AC95","v":4.8011378490013596}]
[null,null,"'Tab 1.2_roh'!$AL$134:$BJ$134",23,null,"d23_F",null,null,null,null,null,null,null,null,null,null,null,null,null,null,null,null,null,null,null,null,null,null,{"$f":"AC95","v":4.8011378490013596},{"$f":"AD95","v":4.3651674191847079}]
[null,null,"'Tab 1.2_roh'!$AL$135:$BJ$135",24,null,"d24_F",null,null,null,null,null,null,null,null,null,null,null,null,null,null,null,null,null,null,null,null,null,null,null,{"$f":"AD95","v":4.3651674191847079},{"$f":"AE95","v":5.2513534658603627}]
[null,null,"'Tab 1.2_roh'!$AL$136:$BJ$136",1,"Männer","d01_M",{"$f":"G96","v":7.5096891957079377},{"$f":"H96","v":7.7012068528725015}]
[null,null,"'Tab 1.2_roh'!$AL$137:$BJ$137",2,null,"d02_M",null,{"$f":"H96","v":7.7012068528725015},{"$f":"I96","v":7.4593686666275669}]
[null,null,"'Tab 1.2_roh'!$AL$138:$BJ$138",3,null,"d03_M",null,null,{"$f":"I96","v":7.4593686666275669},{"$f":"J96","v":7.4748533196944562}]
[null,null,"'Tab 1.2_roh'!$AL$139:$BJ$139",4,null,"d04_M",null,null,null,{"$f":"J96","v":7.4748533196944562},{"$f":"K96","v":6.2970155304527999}]
[null,null,"'Tab 1.2_roh'!$AL$140:$BJ$140",5,null,"d05_M",null,null,null,null,{"$f":"K96","v":6.2970155304527999},{"$f":"L96","v":6.0988893443359169}]
[null,null,"'Tab 1.2_roh'!$AL$141:$BJ$141",6,null,"d06_M",null,null,null,null,null,{"$f":"L96","v":6.0988893443359169},{"$f":"M96","v":7.1829372947495624}]
[null,null,"'Tab 1.2_roh'!$AL$142:$BJ$142",7,null,"d07_M",null,null,null,null,null,null,{"$f":"M96","v":7.1829372947495624},{"$f":"N96","v":9.4829976351626843}]
[null,null,"'Tab 1.2_roh'!$AL$143:$BJ$143",8,null,"d08_M",null,null,null,null,null,null,null,{"$f":"N96","v":9.4829976351626843},{"$f":"O96","v":10.111680302619581}]
[null,null,"'Tab 1.2_roh'!$AL$144:$BJ$144",9,null,"d09_M",null,null,null,null,null,null,null,null,{"$f":"O96","v":10.111680302619581},{"$f":"P96","v":8.2676504980285124}]
[null,null,"'Tab 1.2_roh'!$AL$145:$BJ$145",10,null,"d10_M",null,null,null,null,null,null,null,null,null,{"$f":"P96","v":8.2676504980285124},{"$f":"Q96","v":7.3484357971020318}]
[null,null,"'Tab 1.2_roh'!$AL$146:$BJ$146",11,null,"d11_M",null,null,null,null,null,null,null,null,null,null,{"$f":"Q96","v":7.3484357971020318},{"$f":"R96","v":7.0014140241564498}]
[null,null,"'Tab 1.2_roh'!$AL$147:$BJ$147",12,null,"d12_M",null,null,null,null,null,null,null,null,null,null,null,{"$f":"R96","v":7.0014140241564498},{"$f":"S96","v":7.526295280105022}]
[null,null,"'Tab 1.2_roh'!$AL$148:$BJ$148",13,null,"d13_M",null,null,null,null,null,null,null,null,null,null,null,null,{"$f":"S96","v":7.526295280105022},{"$f":"T96","v":7.7132804589277768}]
[null,null,"'Tab 1.2_roh'!$AL$149:$BJ$149",14,null,"d14_M",null,null,null,null,null,null,null,null,null,null,null,null,null,{"$f":"T96","v":7.7132804589277768},{"$f":"U96","v":7.7809423061274305}]
[null,null,"'Tab 1.2_roh'!$AL$150:$BJ$150",15,null,"d15_M",null,null,null,null,null,null,null,null,null,null,null,null,null,null,{"$f":"U96","v":7.7809423061274305},{"$f":"V96","v":7.0010936510677482}]
[null,null,"'Tab 1.2_roh'!$AL$151:$BJ$151",16,null,"d16_M",null,null,null,null,null,null,null,null,null,null,null,null,null,null,null,{"$f":"V96","v":7.0010936510677482},{"$f":"W96","v":6.0274044913145426}]
[null,null,"'Tab 1.2_roh'!$AL$152:$BJ$152",17,null,"d17_M",null,null,null,null,null,null,null,null,null,null,null,null,null,null,null,null,{"$f":"W96","v":6.0274044913145426},{"$f":"X96","v":5.8582027858472756}]
[null,null,"'Tab 1.2_roh'!$AL$153:$BJ$153",18,null,"d18_M",null,null,null,null,null,null,null,null,null,null,null,null,null,null,null,null,null,{"$f":"X96","v":5.8582027858472756},{"$f":"Y96","v":7.217517456208884}]
[null,null,"'Tab 1.2_roh'!$AL$154:$BJ$154",19,null,"d19_M",null,null,null,null,null,null,null,null,null,null,null,null,null,null,null,null,null,null,{"$f":"Y96","v":7.217517456208884},{"$f":"Z96","v":9.0149086956964535}]
[null,null,"'Tab 1.2_roh'!$AL$155:$BJ$155",20,null,"d20_M",null,null,null,null,null,null,null,null,null,null,null,null,null,null,null,null,null,null,null,{"$f":"Z96","v":9.0149086956964535},{"$f":"AA96","v":6.2438327775184561}]
[null,null,"'Tab 1.2_roh'!$AL$156:$BJ$156",21,null,"d21_M",null,null,null,null,null,null,null,null,null,null,null,null,null,null,null,null,null,null,null,null,{"$f":"AA96","v":6.2438327775184561},{"$f":"AB96","v":4.7821854628291849}]
[null,null,"'Tab 1.2_roh'!$AL$157:$BJ$157",22,null,"d22_M",null,null,null,null,null,null,null,null,null,null,null,null,null,null,null,null,null,null,null,null,null,{"$f":"AB96","v":4.7821854628291849},{"$f":"AC96","v":5.2149521181789806}]
[null,null,"'Tab 1.2_roh'!$AL$158:$BJ$158",23,null,"d23_M",null,null,null,null,null,null,null,null,null,null,null,null,null,null,null,null,null,null,null,null,null,null,{"$f":"AC96","v":5.2149521181789806},{"$f":"AD96","v":5.2371801204493647}]
[null,null,"'Tab 1.2_roh'!$AL$159:$BJ$159",24,null,"d24_M",null,null,null,null,null,null,null,null,null,null,null,null,null,null,null,null,null,null,null,null,null,null,null,{"$f":"AD96","v":5.2371801204493647},{"$f":"AE96","v":5.8074116314656896}]

{"sheet":"Tab 1.2","index":7,"n_rows":52,"n_cols":10,"rows_kept":52,"cut":false,"hidden":false,"merged":[[50,0,50,9],[51,0,51,9],[4,0,4,2],[32,0,34,2],[32,3,32,6],[32,7,32,9],[22,0,30,9]]}
[null,null,null,null,null,null,null,null,null,"Frauen und Männer"]
[]
[{"$f":"Auswahl!F3","v":"1.2 Zugänge in und Abgänge aus Arbeitslosigkeit "}]
[{"$f":"'Tab 1.2_roh'!D4","v":"Deutschland (Gebietsstand: August 2020)"}]
[{"$f":"'Tab 1.2_roh'!D5","v":"2020-08-01"}]
[]
[]
[]
[]
[]
[]
[]
[]
[]
[]
[]
[]
[]
[]
[]
[]
[]
["\nUm ein Gesamtbild zur Arbeitslosigkeit zu erhalten, werden neben dem Bestand an Arbeitslosen die Zu- und Abgänge in und aus Arbeitslosigkeit abgebildet. Diese geben Informationen darüber, woher die Arbeitslosen kommen bzw. wohin sie gehen (Erwerbstätigkeit, Ausbildung/Maßnahmeteilnahme, Nichterwerbstätigkeit oder Sonstiges). Bei der Betrachtung der Bewegungen sind die saisonbedingten Einflüsse zu berücksichtigen. Im Frühjahr sind z.B. witterungsbedingt die Abgänge besonders hoch, insbesondere im Bau- und Gartenbaubereich. Das betrifft vor allem die Männer. Auch durch Einstellungstermine nach den Sommerferien und zu Jahresbeginn ergeben sich erhöhte Abgänge."]
[]
[]
[]
[]
[]
[]
[]
[]
[]
["Merkmale",null,null,"Frauen",null,null,null,"Männer"]
[null,null,null,"Zugang/\nAbgang","Anteil an\nMerkmals-\ngruppe\nin %","Verände-\nrung zum\nVorjahr\nin %","Anteil\nFrauen\nan allen\nPersonen\nin %","Zugang/\nAbgang","Anteil an\nMerkmals-\ngruppe\nin %","Verände-\nrung zum\nVorjahr\nin %"]
[null,null,null,1,2,3,4,5,6,7]
["Zugang an Arbeitslosen",null,null,{"$f":"'Tab 1.2_roh'!C66","v":238322},{"$f":"'Tab 1.2_roh'!D66","v":100},{"$f":"'Tab 1.2_roh'!E66","v":-17.93630406561735},{"$f":"'Tab 1.2_roh'!F66","v":45.430232048327355},{"$f":"'Tab 1.2_roh'!G66","v":286263},{"$f":"'Tab 1.2_roh'!H66","v":100},{"$f":"'Tab 1.2_roh'!I66","v":-18.937585483336587}]
["dav.:","Erwerbstätigkeit",null,{"$f":"'Tab 1.2_roh'!C67","v":87521},{"$f":"'Tab 1.2_roh'!D67","v":36.723844210773663},{"$f":"'Tab 1.2_roh'!E67","v":-7.8978384863090101},{"$f":"'Tab 1.2_roh'!F67","v":43.237541930352386},{"$f":"'Tab 1.2_roh'!G67","v":114898},{"$f":"'Tab 1.2_roh'!H67","v":40.137216475758308},{"$f":"'Tab 1.2_roh'!I67","v":-9.7104239519075879}]
[null,"dar.:","Beschäftigung am 1. Arbeitsmarkt",{"$f":"'Tab 1.2_roh'!C68","v":80767},{"$f":"'Tab 1.2_roh'!D68","v":33.889863294198605},{"$f":"'Tab 1.2_roh'!E68","v":-6.4178620258151229},{"$f":"'Tab 1.2_roh'!F68","v":43.23553185908451},{"$f":"'Tab 1.2_roh'!G68","v":106040},{"$f":"'Tab 1.2_roh'!H68","v":37.042859188927665},{"$f":"'Tab 1.2_roh'!I68","v":-8.1427581427581419}]
[null,null,"Selbständigkeit",{"$f":"'Tab 1.2_roh'!C69","v":2855},{"$f":"'Tab 1.2_roh'!D69","v":1.1979590637876485},{"$f":"'Tab 1.2_roh'!E69","v":-2.2929500342231348},{"$f":"'Tab 1.2_roh'!F69","v":43.754789272030656},{"$f":"'Tab 1.2_roh'!G69","v":3670},{"$f":"'Tab 1.2_roh'!H69","v":1.2820378463161499},{"$f":"'Tab 1.2_roh'!I69","v":-13.402548371873523}]
[null,"Ausbildung u. sonst. Maßnahmeteilnahme",null,{"$f":"'Tab 1.2_roh'!C70","v":77720},{"$f":"'Tab 1.2_roh'!D70","v":32.61134095887077},{"$f":"'Tab 1.2_roh'!E70","v":-10.436065271503642},{"$f":"'Tab 1.2_roh'!F70","v":44.271782719650012},{"$f":"'Tab 1.2_roh'!G70","v":97829},{"$f":"'Tab 1.2_roh'!H70","v":34.174517838491177},{"$f":"'Tab 1.2_roh'!I70","v":-13.068706902680031}]
[null,"Nichterwerbstätigkeit",null,{"$f":"'Tab 1.2_roh'!C71","v":62723},{"$f":"'Tab 1.2_roh'!D71","v":26.318594170911624},{"$f":"'Tab 1.2_roh'!E71","v":-36.658150126738235},{"$f":"'Tab 1.2_roh'!F71","v":50.117457172078751},{"$f":"'Tab 1.2_roh'!G71","v":62429},{"$f":"'Tab 1.2_roh'!H71","v":21.808267222798616},{"$f":"'Tab 1.2_roh'!I71","v":-39.213452513096144}]
[null,"Sonstiges/ Keine Angabe",null,{"$f":"'Tab 1.2_roh'!C72","v":10358},{"$f":"'Tab 1.2_roh'!D72","v":4.3462206594439463},{"$f":"'Tab 1.2_roh'!E72","v":8.0534112247026926},{"$f":"'Tab 1.2_roh'!F72","v":48.253051336998041},{"$f":"'Tab 1.2_roh'!G72","v":11107},{"$f":"'Tab 1.2_roh'!H72","v":3.8799984629519009},{"$f":"'Tab 1.2_roh'!I72","v":4.3302648882209285}]
["Abgang an Arbeitslosen",null,null,{"$f":"'Tab 1.2_roh'!C73","v":208891},{"$f":"'Tab 1.2_roh'!D73","v":100},{"$f":"'Tab 1.2_roh'!E73","v":-20.635927752406861},{"$f":"'Tab 1.2_roh'!F73","v":43.598980629029533},{"$f":"'Tab 1.2_roh'!G73","v":270225},{"$f":"'Tab 1.2_roh'!H73","v":100},{"$f":"'Tab 1.2_roh'!I73","v":-19.671999571940713}]
["dav.:","Erwerbstätigkeit",null,{"$f":"'Tab 1.2_roh'!C74","v":73886},{"$f":"'Tab 1.2_roh'!D74","v":35.370599977978948},{"$f":"'Tab 1.2_roh'!E74","v":-2.1584829704963187},{"$f":"'Tab 1.2_roh'!F74","v":41.1233991395288},{"$f":"'Tab 1.2_roh'!G74","v":105783},{"$f":"'Tab 1.2_roh'!H74","v":39.146266999722449},{"$f":"'Tab 1.2_roh'!I74","v":-0.68629475937435447}]
[null,"dar.:","Beschäftigung am 1. Arbeitsmarkt",{"$f":"'Tab 1.2_roh'!C75","v":66987},{"$f":"'Tab 1.2_roh'!D75","v":32.067920590164249},{"$f":"'Tab 1.2_roh'!E75","v":-1.2340764331210192},{"$f":"'Tab 1.2_roh'!F75","v":41.375029338735779},{"$f":"'Tab 1.2_roh'!G75","v":94915},{"$f":"'Tab 1.2_roh'!H75","v":35.124433342584879},{"$f":"'Tab 1.2_roh'!I75","v":0.7023649114617041}]
[null,null,"Selbständigkeit",{"$f":"'Tab 1.2_roh'!C76","v":3869},{"$f":"'Tab 1.2_roh'!D76","v":1.852162132403981},{"$f":"'Tab 1.2_roh'!E76","v":8.3753501400560211},{"$f":"'Tab 1.2_roh'!F76","v":40.043469261022565},{"$f":"'Tab 1.2_roh'!G76","v":5793},{"$f":"'Tab 1.2_roh'!H76","v":2.1437690813211212},{"$f":"'Tab 1.2_roh'!I76","v":6.6850828729281773}]
[null,"Ausbildung u. sonst. Maßnahmeteilnahme",null,{"$f":"'Tab 1.2_roh'!C77","v":53104},{"$f":"'Tab 1.2_roh'!D77","v":25.421870736412771},{"$f":"'Tab 1.2_roh'!E77","v":-18.160522746886944},{"$f":"'Tab 1.2_roh'!F77","v":41.097395813179581},{"$f":"'Tab 1.2_roh'!G77","v":76110},{"$f":"'Tab 1.2_roh'!H77","v":28.165417707466002},{"$f":"'Tab 1.2_roh'!I77","v":-18.968986553387204}]
[null,"Nichterwerbstätigkeit",null,{"$f":"'Tab 1.2_roh'!C78","v":64616},{"$f":"'Tab 1.2_roh'!D78","v":30.932878869841208},{"$f":"'Tab 1.2_roh'!E78","v":-38.689261891432849},{"$f":"'Tab 1.2_roh'!F78","v":47.982059450347897},{"$f":"'Tab 1.2_roh'!G78","v":70050},{"$f":"'Tab 1.2_roh'!H78","v":25.922842076047736},{"$f":"'Tab 1.2_roh'!I78","v":-40.058016651977098}]
[null,"Sonstiges/ Keine Angabe",null,{"$f":"'Tab 1.2_roh'!C79","v":17285},{"$f":"'Tab 1.2_roh'!D79","v":8.2746504157670753},{"$f":"'Tab 1.2_roh'!E79","v":-0.72368043191086096},{"$f":"'Tab 1.2_roh'!F79","v":48.597053531264059},{"$f":"'Tab 1.2_roh'!G79","v":18282},{"$f":"'Tab 1.2_roh'!H79","v":6.7654732167638079},{"$f":"'Tab 1.2_roh'!I79","v":-4.2726987119070063}]
[null,null,null,null,null,null,null,null,null," © Statistik der Bundesagentur für Arbeit"]
[{"$f":"IF('Tab 1.2_roh'!B104<>\"\",\"Aufgrund unvollständiger Daten können einige Merkmale nicht ausgewertet werden, da diese nicht geschätzt werden.\",\"\")","v":""}]
["Hinweis zur Grafik\nDie Abgangsrate ist der Abgang Arbeitsloser eines Monats bezogen auf den Bestand des Vormonats."]

{"sheet":"Tab 2_roh","index":8,"n_rows":93,"n_cols":49,"rows_kept":93,"cut":false,"hidden":true,"merged":[]}
[null,null,"TabSpalten",null,null,null,null,null,null,null,null,null,null,null,null,null,null,null,null,null,null,null,null,null,null,null,null,null,null,null,null,null,null,null,null,null,null,null,null,null,null,null,null,null,null,null,null,null,"XXX"]
[null,null,"Hilfsspalten"]
[null,null,"Überschrift","2 Unterbeschäftigung "]
[null,null,"Gebiet","Deutschland (Gebietsstand: August 2020)"]
[null,null,"BM","Mai 2020, Daten mit einer Wartezeit von 3 Monaten"]
[]
[]
[]
[null,null,"Frauen","Frauen","Frauen","Frauen","Frauen","Frauen","Männer","Männer","Männer","Männer","Frauen","Frauen","Frauen","Frauen","Frauen","Frauen","Männer","Männer","Männer","Männer","Frauen","Frauen","Frauen","Frauen","Frauen","Frauen","Männer","Männer","Männer","Männer",null,"Frauen","Frauen","Frauen","Männer","Männer","Frauen","Frauen","Frauen","Männer","Männer","Frauen","Frauen","Frauen","Männer","Männer"]
[null,"Tab/DS","Anzahl","VJM","Anteil der\nPersonen-\ngruppe an\nInsgesamt\nin %","Verände-\nrung zum\nVorjahr\nin %","Gesamt","Anteil an\nFrauen\nund Männer\ninsgesamt\nin %","Anzahl","VJM","Anteil der\nPersonen-\ngruppe an\nInsgesamt\nin %","Verände-\nrung zum\nVorjahr\nin %","Anzahl","VJM","Anteil der\nPersonen-\ngruppe an\nInsgesamt\nin %","Verände-\nrung zum\nVorjahr\nin %","Gesamt","Anteil an\nFrauen\nund Männer\ninsgesamt\nin %","Anzahl","VJM","Anteil der\nPersonen-\ngruppe an\nInsgesamt\nin %","Verände-\nrung zum\nVorjahr\nin %","Anzahl","VJM","Anteil der\nPersonen-\ngruppe an\nInsgesamt\nin %","Verände-\nrung zum\nVorjahr\nin %","Gesamt","Anteil an\nFrauen\nund Männer\ninsgesamt\nin %","Anzahl","VJM","Anteil der\nPersonen-\ngruppe an\nInsgesamt\nin %","Verände-\nrung zum\nVorjahr\nin %",null,"Anteil der\nPersonen-\ngruppe an\nInsgesamt\nin %","Verände-\nrung zum\nVorjahr\nin %","Anteil an\nFrauen\nund Männer\ninsgesamt\nin %","Anteil der\nPersonen-\ngruppe an\nInsgesamt\nin %","Verände-\nrung zum\nVorjahr\nin %","Anteil der\nPersonen-\ngruppe an\nInsgesamt\nin %","Verände-\nrung zum\nVorjahr\nin %","Anteil an\nFrauen\nund Männer\ninsgesamt\nin %","Anteil der\nPersonen-\ngruppe an\nInsgesamt\nin %","Verände-\nrung zum\nVorjahr\nin %","Anteil der\nPersonen-\ngruppe an\nInsgesamt\nin %","Verände-\nrung zum\nVorjahr\nin %","Anteil an\nFrauen\nund Männer\ninsgesamt\nin %","Anteil der\nPersonen-\ngruppe an\nInsgesamt\nin %","Verände-\nrung zum\nVorjahr\nin %"]
[null,null,1,0,2,3,0,4,5,0,6,7,null,null,null,null,null,null,null,null,null,null,null,null,null,null,null,null,null,null,null,null,null,2,3,4,6,7]
[null,null,1,2,3,4,5,6,7,8,9,10,1,2,3,4,5,6,7,8,9,10,1,2,3,4,5,6,7,8,9,10,null,3,4,6,9,10,3,4,6,9,10,3,4,6,9,10]
[null,null,"1Insgesamt","2Insgesamt",null,null,"5Insgesamt",null,"7Insgesamt","8Insgesamt",null,null,"1SGB III","2SGB III",null,null,"5SGB III",null,"7SGB III","8SGB III",null,null,"1SGB II","2SGB II",null,null,"5SGB II",null,"7SGB II","8SGB II",null,null,null,"3Insgesamt","4Insgesamt","6Insgesamt","9Insgesamt","10Insgesamt","3SGB III","4SGB III","6SGB III","9SGB III","10SGB III","3SGB II","4SGB II","6SGB II","9SGB II","10SGB II"]
[null,"ID für Auswahl","Insgesamt",null,null,null,null,null,null,null,null,null,"SGB III",null,null,null,null,null,null,null,null,null,"SGB II"]
[null,null,1224064,992681,null,null,2812986,null,1588912,1243285,null,null,494400,336810,null,null,1172340,null,677930,435503,null,null,729664,655871,null,null,1640646,null,910982,807782,null,null,null,76.91003692619725,23.308897823167765,43.514756205683213,79.834353383802423,27.799498908134503,84.775552267111578,46.788990825688074,42.17206612416193,88.272135416666657,55.665977042638048,72.361027642740822,11.251145423414055,44.474188825621127,74.532526195305266,12.775724143395124]
[null,null,147385,178750,null,null,314668,null,167281,211481,null,null,8213,17949,null,null,19569,null,11355,23279,null,null,139172,160801,null,null,295099,null,155926,188202,null,null,null,9.260451898240273,-17.546853146853149,46.83825492264863,8.4049780405685492,-20.900222715042961,1.4082961382884049,-54.242576188088478,41.969441463539269,1.478515625,-51.222131534859749,13.80173468760351,-13.450786997593298,47.16112219966859,12.75717706774576,-17.149658345819919]
[null,null,62487,95542,null,null,140923,null,78434,124761,null,null,8206,17944,null,null,19554,null,11347,23275,null,null,54281,77598,null,null,121369,null,67087,101486,null,null,null,3.9261651983942727,-34.597349856607565,44.341235994124453,3.9408901646567962,-37.132597526470612,1.4070958371842994,-54.268836379848416,41.965838191674337,1.4774739583333334,-51.248120300751879,5.3830652759018056,-30.048454857083946,44.723941039309871,5.4887622201804689,-33.895315610034885]
[null,null,84898,83208,null,null,173745,null,88847,86720,null,null,7,5,null,null,15,null,8,4,null,null,84891,83203,null,null,173730,null,88839,86716,null,null,null,5.3342866998459995,2.0310547062782423,48.863564419119975,4.4640878759117522,2.452721402214022,1.2003011041055443E-3,40,46.666666666666664,1.0416666666666667E-3,100,8.4186694117017034,2.0287730009735228,48.863754101191503,7.2684148475652908,2.4482217814474838]
[null,null,1371449,1171431,null,null,3127654,null,1756193,1454766,null,null,502613,354759,null,null,1191909,null,689285,458782,null,null,868836,816672,null,null,1935745,null,1066908,995984,null,null,null,86.170488824437513,17.074671918363098,43.849127812731204,88.239331424370974,20.719964585369745,86.183848405399985,41.677307693391853,42.168739392017343,89.750651041666657,50.242380912939041,86.16276233034435,6.3873868578817437,44.883804426719429,87.289703263051024,7.1209979276775526]
[null,null,211552,256564,null,null,434999,null,223446,285766,null,null,72473,76438,null,null,141150,null,68676,73254,null,null,139079,180126,null,null,293849,null,154770,212512,null,null,null,13.292174373080885,-17.544160521351397,48.632755477598799,11.226969729095831,-21.808052742453615,12.4270602739773,-5.1872105497265757,51.344668792065171,8.9421874999999993,-6.2494880825620447,13.792511845897224,-22.787937332755959,47.330091305398355,12.662598250291875,-27.171171510314711]
[null,null,77109,84844,null,null,154793,null,77684,86448,null,null,55077,57390,null,null,105357,null,50280,52726,null,null,22032,27454,null,null,49436,null,27404,33722,null,null,null,4.8448904937504436,-9.1167318843996039,49.814268087058203,3.9032066648545092,-10.137886359429945,9.4441405586887228,-4.0303188708834297,52.276545459722655,6.5468750000000009,-4.6390774949740168,2.1849209513212462,-19.749398994682014,44.566712517193949,2.2420743196420405,-18.735543562066308]
[null,null,20948,30233,null,null,52540,null,31592,46650,null,null,0,0,null,null,0,null,0,0,null,null,20948,30233,null,null,52540,null,31592,46650,null,null,null,1.3161987065463734,-30.711474216915292,39.870574800152262,1.5873295010051445,-32.278670953912112,0,"X","X",0,"X",2.0774203017555131,-30.711474216915292,39.870574800152262,2.5847179939472831,-32.278670953912112]
[null,null,77456,100288,null,null,142633,null,65176,102566,null,null,9299,8783,null,null,18240,null,8940,9198,null,null,68157,91505,null,null,124393,null,56236,93368,null,null,null,4.8666930978735863,-22.766432673899171,54.304403609262927,3.274746377485164,-36.454575590351581,1.5945142810110651,5.8749857679608342,50.981359649122801,1.1640625,-2.804957599478147,6.7591529266159318,-25.515545598601168,54.791668341466163,4.600981296138877,-39.76951418044726]
[null,null,478,1796,null,null,1327,null,849,3455,null,null,0,0,null,null,0,null,0,0,null,null,478,1796,null,null,1327,null,849,3455,null,null,null,3.003355841747023E-2,-73.385300668151444,36.021100226073848,4.265772177618915E-2,-75.426917510853826,0,"X","X",0,"X",4.7403422963487464E-2,-73.385300668151444,36.021100226073848,6.9461432541822077E-2,-75.426917510853826]
[null,null,540,636,null,null,1599,null,1059,1221,null,null,0,0,null,null,0,null,0,0,null,null,540,636,null,null,1599,null,1059,1221,null,null,null,3.3929124572037499E-2,-15.09433962264151,33.771106941838646,5.3209101720829585E-2,-13.267813267813267,0,"X","X",0,"X",5.3551984101010947E-2,-15.09433962264151,33.771106941838646,8.6642705608703866E-2,-13.267813267813267]
[null,null,14776,6030,null,null,39209,null,24433,10317,null,null,0,0,null,null,0,null,0,0,null,null,14776,6030,null,null,39209,null,24433,10317,null,null,null,0.92840137903041875,145.04145936981757,37.685225330918918,1.2276279342257121,136.82271978288264,0,"X","X",0,"X",1.4653409575491438,145.04145936981757,37.685225330918918,1.9990002135386795,136.82271978288264]
[null,null,20245,32737,null,null,42898,null,22653,35109,null,null,8097,10265,null,null,17553,null,9456,11330,null,null,12148,22472,null,null,25345,null,13197,23779,null,null,null,1.2720280128905541,-38.158658398753701,47.193342346962567,1.1381924280282836,-35.478082542937706,1.3884054342775132,-21.120311738918655,46.128866860365747,1.23125,-16.540158870255958,1.2047213015908906,-45.941616233535065,47.930558295521799,1.0797202888744712,-44.501450860002521]
[null,null,1583001,1427995,null,null,3562653,null,1979639,1740532,null,null,575086,431197,null,null,1333059,null,757961,532036,null,null,1007915,996798,null,null,2229594,null,1221678,1208496,null,null,null,99.462663197518395,10.854799911764397,44.433207500141044,99.466301153466802,13.737581383163308,98.610908679377289,33.369666301017865,43.140326122099623,98.692838541666674,42.464231743716589,99.955274176241559,1.1152710980559752,45.20621243150098,99.952301513342888,1.0907772967390872]
[null,null,8552,9534,null,null,19174,null,10622,11998,null,null,8101,9035,null,null,18140,null,10039,11344,null,null,451,499,null,null,1034,null,583,654,null,null,null,0.53733680248160132,-10.299979022445983,44.602065296756024,0.53369884653319333,-11.468578096349392,1.3890913206227162,-10.337576092971776,44.65821389195149,1.3071614583333333,-11.503878702397744,4.4725823758436922E-2,-9.6192384769539085,43.61702127659575,4.7698486657105153E-2,-10.856269113149846]
[null,null,8101,9035,null,null,18140,null,10039,11344,null,null,8101,9035,null,null,18140,null,10039,11344,null,null,0,0,null,null,0,null,0,0,null,null,null,0.50899970029273289,-10.337576092971776,44.65821389195149,0.50440620602021546,-11.503878702397744,1.3890913206227162,-10.337576092971776,44.65821389195149,1.3071614583333333,-11.503878702397744,0,"X","X",0,"X"]
[null,null,451,499,null,null,1034,null,583,654,null,null,0,0,null,null,0,null,0,0,null,null,451,499,null,null,1034,null,583,654,null,null,null,2.8337102188868354E-2,-9.6192384769539085,43.61702127659575,2.9292640512977943E-2,-10.856269113149846,0,"X","X",0,"X",4.4725823758436922E-2,-9.6192384769539085,43.61702127659575,4.7698486657105153E-2,-10.856269113149846]
[null,null,1591553,1437529,null,null,3581827,null,1990261,1752530,null,null,583187,440232,null,null,1351199,null,768000,543380,null,null,1008366,997297,null,null,2230628,null,1222261,1209150,null,null,null,100,10.714496890149693,44.434111418558182,100,13.56501743194125,100,32.472650784132,43.160703937761937,100,41.337553829732414,100,1.1099000598618065,45.205475767362373,100,1.0843154281933589]
[]
[]
[null,"DiaDatRoh"]
[null,"UB-Quote"]
[]
[null,null,null,null,"Dezember 2012","Dezember 2013","Dezember 2014","Dezember 2015","Dezember 2016","Dezember 2017","Dezember 2018","Dezember 2019"]
[null,"Weiblich","Insgesamt","WeiblichInsgesamt",8.7525419662654969,8.6094404390533654,8.2385726686414742,7.6917748700790769,7.3883951034902005,7.0587041436197522,6.6128135380846196,6.5586667008166959]
[null,"Männlich","Insgesamt","MännlichInsgesamt",8.9657820044891352,8.7729987099734306,8.3900377603256846,8.042980850110018,8.3520620266304579,7.770891701626824,7.0846380583433417,7.0899684883398439]
[null,"Weiblich","SGB III","WeiblichSGB III",2.6073744636650091,2.5790463346518937,2.415168714788674,2.1614985024230489,2.0469436108490568,2.1157425904122973,2.0569305842772492,2.1158127195309109]
[null,"Männlich","SGB III","MännlichSGB III",2.8235960892220002,2.7608587322605742,2.5529937965452083,2.3243003999985685,2.4059764632460343,2.298451923210429,2.2069335429575738,2.4141698282324762]
[null,"Weiblich","SGB II","WeiblichSGB II",6.1451675026004873,6.0303941044014726,5.823403953852802,5.5302763676560289,5.341451492641144,4.9429615532074545,4.5558829538073704,4.4428539812857846]
[null,"Männlich","SGB II","MännlichSGB II",6.1421859152671354,6.0121399777128559,5.8370439637804772,5.7186804501114494,5.9460855633844236,5.472439778416395,4.8777045153857674,4.6757986601073682]
[]
[]
[]
[]
[]
[]
[]
[]
[]
[]
[]
[]
[null,null,"Frauen","Frauen","Frauen","Frauen","Männer","Männer","Männer"]
[null,"Tab","Bestand","Anteil der\nMerkmals-\ngruppe an\nInsgesamt\nin %","Verände-\nrung zum\nVorjahr\nin %","Anteil an\nallen Personen\nin %","Bestand","Anteil der\nMerkmals-\ngruppe an\nInsgesamt\nin %","Verände-\nrung zum\nVorjahr\nin %"]
[null,null,1,2,3,4,5,6,7]
[null,{"$f":"Auswahl!$A$2","v":"Insgesamt"},1,3,4,6,7,9,10,"Spalte in der Tabelle Tab/DS für Insgesamt"]
[null,null,{"$f":"MATCH(C60&$B$60,$C$13:$AV$13,0)","v":1},{"$f":"MATCH(D60&$B$60,$C$13:$AV$13,0)","v":32},33,34,7,35,36,"Berechnete Spalte in Tab/DS (Merkmalsspalte+Auftreten der Merkmalsauswahl"]
[1,"Arbeitslose",{"$f":"INDEX($C$15:$AV$32,$A62,C$61)","v":1224064},76.91003692619725,23.308897823167765,43.514756205683213,1588912,79.834353383802423,27.799498908134503]
[2,"Personen, die im weiteren Sinne arbeitslos sind",147385,9.260451898240273,-17.546853146853149,46.83825492264863,167281,8.4049780405685492,-20.900222715042961]
[3,"Aktivierung und berufliche Eingliederung",62487,3.9261651983942727,-34.597349856607565,44.341235994124453,78434,3.9408901646567962,-37.132597526470612]
[4,"Sonderregelungen für Ältere (§ 53a Abs. 2 SGB II)",84898,5.3342866998459995,2.0310547062782423,48.863564419119975,88847,4.4640878759117522,2.452721402214022]
[5,"Arbeitslosigkeit im weiteren Sinne",1371449,86.170488824437513,17.074671918363098,43.849127812731204,1756193,88.239331424370974,20.719964585369745]
[6,"Personen, die nahe am Arbeitslosenstatus sind",211552,13.292174373080885,-17.544160521351397,48.632755477598799,223446,11.226969729095831,-21.808052742453615]
[7,"Berufliche Weiterbildung (einschl. Förderung behinderter Menschen)",77109,4.8448904937504436,-9.1167318843996039,49.814268087058203,77684,3.9032066648545092,-10.137886359429945]
[8,"Arbeitsgelegenheiten",20948,1.3161987065463734,-30.711474216915292,39.870574800152262,31592,1.5873295010051445,-32.278670953912112]
[9,"Fremdförderung",77456,4.8666930978735863,-22.766432673899171,54.304403609262927,65176,3.274746377485164,-36.454575590351581]
[10,"Förderung von Arbeitsverhältnissen",478,3.003355841747023E-2,-73.385300668151444,36.021100226073848,849,4.265772177618915E-2,-75.426917510853826]
[11,"Beschäftigungszuschuss",{"$f":"INDEX($C$15:$AV$32,$A72,C$61)","v":540},3.3929124572037499E-2,-15.09433962264151,33.771106941838646,1059,5.3209101720829585E-2,-13.267813267813267]
[12,"Bundesprogramm ''Soziale Teilhabe am Arbeitsmarkt''",14776,0.92840137903041875,145.04145936981757,37.685225330918918,24433,1.2276279342257121,136.82271978288264]
[13,"kurzfristige Arbeitsunfähigkeit",20245,1.2720280128905541,-38.158658398753701,47.193342346962567,22653,1.1381924280282836,-35.478082542937706]
[14,"Unterbeschäftigung im engeren Sinne",1583001,99.462663197518395,10.854799911764397,44.433207500141044,1979639,99.466301153466802,13.737581383163308]
[15,"#Personen, die fern vom Arbeitslosenstatus sind",8552,0.53733680248160132,-10.299979022445983,44.602065296756024,10622,0.53369884653319333,-11.468578096349392]
[16,"Gründungszuschuss",8101,0.50899970029273289,-10.337576092971776,44.65821389195149,10039,0.50440620602021546,-11.503878702397744]
[17,"Einstiegsgeld - Variante: Selbständigkeit",451,2.8337102188868354E-2,-9.6192384769539085,43.61702127659575,583,2.9292640512977943E-2,-10.856269113149846]
[18,"Unterbeschäftigung (ohne Kurzarbeit)",1591553,100,10.714496890149693,44.434111418558182,1990261,100,13.56501743194125]
[]
[]
[]
[null,"Diadat"]
[null,null,null,null,2,3,4,5,6,7,8,9]
[null,null,null,null,{"$f":"E38","v":"Dezember 2012"},"Dezember 2013","Dezember 2014","Dezember 2015","Dezember 2016","Dezember 2017","Dezember 2018","Dezember 2019"]
[null,"Weiblich",{"$f":"$B$60","v":"Insgesamt"},{"$f":"B86&C86","v":"WeiblichInsgesamt"},{"$f":"VLOOKUP($D86,$D$39:$L$44,E$84,0)","v":8.7525419662654969},8.6094404390533654,8.2385726686414742,7.6917748700790769,7.3883951034902005,7.0587041436197522,6.6128135380846196,6.5586667008166959]
[null,"Männlich",{"$f":"$B$60","v":"Insgesamt"},{"$f":"B87&C87","v":"MännlichInsgesamt"},8.9657820044891352,8.7729987099734306,8.3900377603256846,8.042980850110018,8.3520620266304579,7.770891701626824,7.0846380583433417,7.0899684883398439]
[]
[]
[null,"Datenbeschriftung"]
[null,null,null,null,{"$f":"TEXT(E85,\"MMM JJJJ\")","v":"Dez 2012"},"Dez 2013","Dez 2014","Dez 2015","Dez 2016","Dez 2017","Dez 2018","Dez 2019"]
[null,"Weiblich",{"$f":"$B$60","v":"Insgesamt"},{"$f":"B92&C92","v":"WeiblichInsgesamt"},{"$f":"IFERROR(E86,\"\")","v":8.7525419662654969},8.6094404390533654,8.2385726686414742,7.6917748700790769,7.3883951034902005,7.0587041436197522,6.6128135380846196,6.5586667008166959]
[null,"Männlich",{"$f":"$B$60","v":"Insgesamt"},{"$f":"B93&C93","v":"MännlichInsgesamt"},8.9657820044891352,8.7729987099734306,8.3900377603256846,8.042980850110018,8.3520620266304579,7.770891701626824,7.0846380583433417,7.0899684883398439]

{"sheet":"Tab 2","index":9,"n_rows":58,"n_cols":9,"rows_kept":58,"cut":false,"hidden":false,"merged":[[56,0,56,8],[49,0,49,1],[4,0,4,1],[5,6,6,6],[32,0,34,1],[32,2,32,5],[32,6,32,8],[22,0,30,8],[36,0,36,1],[40,0,40,1]]}
[null,null,null,null,null,null,null,null,"Frauen und Männer"]
[]
[{"$f":"Auswahl!F4","v":"2 Unterbeschäftigung "}]
[{"$f":"'Tab 2_roh'!D4","v":"Deutschland (Gebietsstand: August 2020)"}]
[{"$f":"'Tab 2_roh'!D5","v":"Mai 2020, Daten mit einer Wartezeit von 3 Monaten"}]
[]
[]
[]
[]
[]
[]
[]
[]
[]
[]
[]
[]
[]
[]
[]
[]
[]
["\nIn der Unterbeschäftigung werden zusätzlich zu den registrierten Arbeitslosen auch die Personen abgebildet, die nicht als arbeitslos gelten, weil sie Teilnehmer an einer Maßnahme der Arbeitsmarktpolitik oder in einem arbeitsmarktbedingten Sonderstatus sind. Diese Personen stehen für Menschen, denen ein reguläres Beschäftigungsverhältnis fehlt. Es wird unterstellt, dass ohne den Einsatz dieser Maßnahmen bzw. ohne die Zuweisung zu einem Sonderstatus die Arbeitslosigkeit entsprechend höher ausfallen würde. Mit dem Konzept der Unterbeschäftigung werden Defizite an regulärer Beschäftigung umfassender erfasst und realwirtschaftlich bedingte Einflüsse auf den Arbeitsmarkt besser erkannt. Zudem können die direkten Auswirkungen der Arbeitsmarktpolitik auf die Arbeitslosenzahlen nachvollzogen werden."]
[]
[]
[]
[]
[]
[]
[]
[]
[]
["Komponenten der \nUnterbeschäftigung",null,"Frauen",null,null,null,"Männer"]
[null,null,"Bestand","Anteil der\nKompo-\nnenten\nin %","Verände-\nrung zum\nVorjahr\nin %","Anteil\nFrauen\nan allen\nPersonen\nin %","Bestand","Anteil der\nKompo-\nnenten\nin %","Verände-\nrung zum\nVorjahr\nin %"]
[null,null,1,2,3,4,5,6,7]
["Arbeitslose",null,{"$f":"'Tab 2_roh'!C62","v":1224064},{"$f":"'Tab 2_roh'!D62","v":76.91003692619725},{"$f":"'Tab 2_roh'!E62","v":23.308897823167765},{"$f":"'Tab 2_roh'!F62","v":43.514756205683213},{"$f":"'Tab 2_roh'!G62","v":1588912},{"$f":"'Tab 2_roh'!H62","v":79.834353383802423},{"$f":"'Tab 2_roh'!I62","v":27.799498908134503}]
["+ Personen, die im weiteren Sinne arbeitslos sind  ",null,{"$f":"'Tab 2_roh'!C63","v":147385},{"$f":"'Tab 2_roh'!D63","v":9.260451898240273},{"$f":"'Tab 2_roh'!E63","v":-17.546853146853149},{"$f":"'Tab 2_roh'!F63","v":46.83825492264863},{"$f":"'Tab 2_roh'!G63","v":167281},{"$f":"'Tab 2_roh'!H63","v":8.4049780405685492},{"$f":"'Tab 2_roh'!I63","v":-20.900222715042961}]
[null,"Aktivierung und berufliche Eingliederung",{"$f":"'Tab 2_roh'!C64","v":62487},{"$f":"'Tab 2_roh'!D64","v":3.9261651983942727},{"$f":"'Tab 2_roh'!E64","v":-34.597349856607565},{"$f":"'Tab 2_roh'!F64","v":44.341235994124453},{"$f":"'Tab 2_roh'!G64","v":78434},{"$f":"'Tab 2_roh'!H64","v":3.9408901646567962},{"$f":"'Tab 2_roh'!I64","v":-37.132597526470612}]
[null,"Sonderregelung für Ältere (§ 53a Abs. 2 SGB II)",{"$f":"'Tab 2_roh'!C65","v":84898},{"$f":"'Tab 2_roh'!D65","v":5.3342866998459995},{"$f":"'Tab 2_roh'!E65","v":2.0310547062782423},{"$f":"'Tab 2_roh'!F65","v":48.863564419119975},{"$f":"'Tab 2_roh'!G65","v":88847},{"$f":"'Tab 2_roh'!H65","v":4.4640878759117522},{"$f":"'Tab 2_roh'!I65","v":2.452721402214022}]
["= Arbeitslosigkeit im weiteren Sinne",null,{"$f":"'Tab 2_roh'!C66","v":1371449},{"$f":"'Tab 2_roh'!D66","v":86.170488824437513},{"$f":"'Tab 2_roh'!E66","v":17.074671918363098},{"$f":"'Tab 2_roh'!F66","v":43.849127812731204},{"$f":"'Tab 2_roh'!G66","v":1756193},{"$f":"'Tab 2_roh'!H66","v":88.239331424370974},{"$f":"'Tab 2_roh'!I66","v":20.719964585369745}]
["+ Personen, die nahe am Arbeitslosenstatus sind",null,{"$f":"'Tab 2_roh'!C67","v":211552},{"$f":"'Tab 2_roh'!D67","v":13.292174373080885},{"$f":"'Tab 2_roh'!E67","v":-17.544160521351397},{"$f":"'Tab 2_roh'!F67","v":48.632755477598799},{"$f":"'Tab 2_roh'!G67","v":223446},{"$f":"'Tab 2_roh'!H67","v":11.226969729095831},{"$f":"'Tab 2_roh'!I67","v":-21.808052742453615}]
[null,"Berufliche Weiterbildung inkl. Förd. behindert. Menschen",{"$f":"'Tab 2_roh'!C68","v":77109},{"$f":"'Tab 2_roh'!D68","v":4.8448904937504436},{"$f":"'Tab 2_roh'!E68","v":-9.1167318843996039},{"$f":"'Tab 2_roh'!F68","v":49.814268087058203},{"$f":"'Tab 2_roh'!G68","v":77684},{"$f":"'Tab 2_roh'!H68","v":3.9032066648545092},{"$f":"'Tab 2_roh'!I68","v":-10.137886359429945}]
[null,"Arbeitsgelegenheiten",{"$f":"'Tab 2_roh'!C69","v":20948},{"$f":"'Tab 2_roh'!D69","v":1.3161987065463734},{"$f":"'Tab 2_roh'!E69","v":-30.711474216915292},{"$f":"'Tab 2_roh'!F69","v":39.870574800152262},{"$f":"'Tab 2_roh'!G69","v":31592},{"$f":"'Tab 2_roh'!H69","v":1.5873295010051445},{"$f":"'Tab 2_roh'!I69","v":-32.278670953912112}]
[null,"Fremdförderung",{"$f":"'Tab 2_roh'!C70","v":77456},{"$f":"'Tab 2_roh'!D70","v":4.8666930978735863},{"$f":"'Tab 2_roh'!E70","v":-22.766432673899171},{"$f":"'Tab 2_roh'!F70","v":54.304403609262927},{"$f":"'Tab 2_roh'!G70","v":65176},{"$f":"'Tab 2_roh'!H70","v":3.274746377485164},{"$f":"'Tab 2_roh'!I70","v":-36.454575590351581}]
[null,"Förderung von Arbeitsverhältnissen",{"$f":"'Tab 2_roh'!C71","v":478},{"$f":"'Tab 2_roh'!D71","v":3.003355841747023E-2},{"$f":"'Tab 2_roh'!E71","v":-73.385300668151444},{"$f":"'Tab 2_roh'!F71","v":36.021100226073848},{"$f":"'Tab 2_roh'!G71","v":849},{"$f":"'Tab 2_roh'!H71","v":4.265772177618915E-2},{"$f":"'Tab 2_roh'!I71","v":-75.426917510853826}]
[null,"Beschäftigungszuschuss",{"$f":"'Tab 2_roh'!C72","v":540},{"$f":"'Tab 2_roh'!D72","v":3.3929124572037499E-2},{"$f":"'Tab 2_roh'!E72","v":-15.09433962264151},{"$f":"'Tab 2_roh'!F72","v":33.771106941838646},{"$f":"'Tab 2_roh'!G72","v":1059},{"$f":"'Tab 2_roh'!H72","v":5.3209101720829585E-2},{"$f":"'Tab 2_roh'!I72","v":-13.267813267813267}]
[null,"Teilhabe am Arbeitsmarkt 1)",{"$f":"'Tab 2_roh'!C73","v":14776},{"$f":"'Tab 2_roh'!D73","v":0.92840137903041875},{"$f":"'Tab 2_roh'!E73","v":145.04145936981757},{"$f":"'Tab 2_roh'!F73","v":37.685225330918918},{"$f":"'Tab 2_roh'!G73","v":24433},{"$f":"'Tab 2_roh'!H73","v":1.2276279342257121},{"$f":"'Tab 2_roh'!I73","v":136.82271978288264}]
[null,"kurzfristige Arbeitsunfähigkeit",{"$f":"'Tab 2_roh'!C74","v":20245},{"$f":"'Tab 2_roh'!D74","v":1.2720280128905541},{"$f":"'Tab 2_roh'!E74","v":-38.158658398753701},{"$f":"'Tab 2_roh'!F74","v":47.193342346962567},{"$f":"'Tab 2_roh'!G74","v":22653},{"$f":"'Tab 2_roh'!H74","v":1.1381924280282836},{"$f":"'Tab 2_roh'!I74","v":-35.478082542937706}]
["= Unterbeschäftigung im engeren Sinne",null,{"$f":"'Tab 2_roh'!C75","v":1583001},{"$f":"'Tab 2_roh'!D75","v":99.462663197518395},{"$f":"'Tab 2_roh'!E75","v":10.854799911764397},{"$f":"'Tab 2_roh'!F75","v":44.433207500141044},{"$f":"'Tab 2_roh'!G75","v":1979639},{"$f":"'Tab 2_roh'!H75","v":99.466301153466802},{"$f":"'Tab 2_roh'!I75","v":13.737581383163308}]
["+ Personen, die fern vom Arbeitslosenstatus sind",null,{"$f":"'Tab 2_roh'!C76","v":8552},{"$f":"'Tab 2_roh'!D76","v":0.53733680248160132},{"$f":"'Tab 2_roh'!E76","v":-10.299979022445983},{"$f":"'Tab 2_roh'!F76","v":44.602065296756024},{"$f":"'Tab 2_roh'!G76","v":10622},{"$f":"'Tab 2_roh'!H76","v":0.53369884653319333},{"$f":"'Tab 2_roh'!I76","v":-11.468578096349392}]
[null,"Gründungszuschuss",{"$f":"'Tab 2_roh'!C77","v":8101},{"$f":"'Tab 2_roh'!D77","v":0.50899970029273289},{"$f":"'Tab 2_roh'!E77","v":-10.337576092971776},{"$f":"'Tab 2_roh'!F77","v":44.65821389195149},{"$f":"'Tab 2_roh'!G77","v":10039},{"$f":"'Tab 2_roh'!H77","v":0.50440620602021546},{"$f":"'Tab 2_roh'!I77","v":-11.503878702397744}]
[null,"Einstiegsgeld - Variante: Selbständigkeit",{"$f":"'Tab 2_roh'!C78","v":451},{"$f":"'Tab 2_roh'!D78","v":2.8337102188868354E-2},{"$f":"'Tab 2_roh'!E78","v":-9.6192384769539085},{"$f":"'Tab 2_roh'!F78","v":43.61702127659575},{"$f":"'Tab 2_roh'!G78","v":583},{"$f":"'Tab 2_roh'!H78","v":2.9292640512977943E-2},{"$f":"'Tab 2_roh'!I78","v":-10.856269113149846}]
["= Unterbeschäftigung (ohne Kurzarbeit)",null,{"$f":"'Tab 2_roh'!C79","v":1591553},{"$f":"'Tab 2_roh'!D79","v":100},{"$f":"'Tab 2_roh'!E79","v":10.714496890149693},{"$f":"'Tab 2_roh'!F79","v":44.434111418558182},{"$f":"'Tab 2_roh'!G79","v":1990261},{"$f":"'Tab 2_roh'!H79","v":100},{"$f":"'Tab 2_roh'!I79","v":13.56501743194125}]
[null,null,null,null,null,null,null,null," © Statistik der Bundesagentur für Arbeit"]
[]
["Weiterführende Hinweise zur Unterbeschäftigung"]
["1) Die Förderungen zur Teilhabe am Arbeitsmarkt sind insgesamt bundesweit übererfasst. Für einzelne Jobcenter fällt die Übererfassung deutlich höher aus. Näheres siehe unter folgendem Link: "]
["Förderung zur Teilhabe am Arbeitsmarkt - Übererfassung"]

{"sheet":"Tab 3","index":10,"n_rows":53,"n_cols":10,"rows_kept":53,"cut":false,"hidden":false,"merged":[[49,0,49,9],[51,0,51,9],[4,0,4,3],[22,0,30,9],[48,0,48,4],[50,0,50,9],[32,0,34,3],[32,4,32,5],[32,6,32,9],[35,0,35,3]]}
[null,null,null,null,null,null,null,null,null,"Frauen und Männer"]
[]
["3 Gemeldete Arbeitsstellen"]
["Deutschland (Gebietsstand: August 2020)"]
["August 2020"]
[]
[]
[]
[]
[]
[]
[]
[]
[]
[]
[]
[]
[]
[]
[]
[]
[]
["\nDie Statistik umfasst alle der Bundesagentur für Arbeit gemeldeten Arbeitsstellen. Daher bilden die gemeldeten Arbeitsstellen nur einen Teil des gesamtwirtschaftlichen Stellenangebots ab.\n\nDie bei den zugelassenen kommunalen Trägern gemeldeten Arbeitsstellen sind nicht enthalten. Es werden nur die Stellen des 1. Arbeitsmarktes mit einer vorgesehenen Beschäftigungsdauer von mehr als sieben Kalendertagen berücksichtigt."]
[]
[]
[]
[]
[]
[]
[]
[]
[]
["Merkmale",null,null,null,"Bestand",null,"Zugang"]
[null,null,null,null,"Insgesamt","Verände-\nrung zum\nVorjahr\nin %","Insgesamt","Verände-\nrung zum\nVorjahr\nin %","gleitende\nJahres-\nsumme","Verände-\nrung zum\nVorjahr\nin %"]
[null,null,null,null,1,2,3,4,5,6]
["Gemeldete Arbeitsstellen",null,null,null,584221,-26.505593651680236,133779,-25.366531286262607,1664322,-24.252697634219501]
["dar.:","sozialvers.pflichtige Beschäftigung",null,null,570058,-26.154463961863307,130293,-25.107774724958897,1617253,-23.985480066818386]
[null,"nach Arbeitszeit"]
[null,"dar.:","Vollzeit oder Teilzeit",null,119681,-20.446553798499078,26573,-15.091385480572594,320681,-16.535402329963667]
[null,null,"Teilzeit",null,70999,-23.266722145968199,21592,-17.747895318273589,249261,-18.986934477379091]
[null,"nach Anforderungsniveau"]
[null,"dar.:","Helfer 1)",null,103623,"X",26937,"X",306481,"X"]
[null,null,"Fachkraft 1)",null,363873,"X",77259,"X",995122,"X"]
[null,null,"Spezialist/Experte",null,102557,-23.03010289471117,26088,-18.706179302608206,315631,-18.187072960839412]
[null,"nach ausgewählten Merkmalen"]
[null,"dar.:","MINT-Berufe 2)",null,164846,-29.384600885873148,32619,-29.800284078681184,418790,-27.65212764487195]
[null,null,"Arbeitnehmerüberlassung (ANÜ) 3)",null,161609,-33.391722239166455,34209,-39.826915973333797,455217,-33.221502108021042]
[null,"geringfügige Arbeitsstellen",null,null,10180,-41.591600206552293,2952,-28.66118898018366,39815,-27.477231329690344]
[null,null,null,null,null,null,null,null,null," © Statistik der Bundesagentur für Arbeit"]
[]
["1)  Ab Januar 2020 gehören einige Berufspositionen nach der KldB 2010 zum Anforderungsniveau „Helfer“, die bisher dem Anforderungsniveau „Fachkraft“ zugeordnet waren. Nähere Informationen finden Sie in der Kurzinfo unter \nhttps://statistik.arbeitsagentur.de/DE/Statischer-Content/Statistiken/Fachstatistiken/Arbeitsuche-Arbeitslosigkeit-Unterbeschaeftigung/Generische-Publikationen/Kurzinfo-DKZ-Aenderungen.pdf"]
["2) Weiterführende Hinweise zu Berufsaggregaten"]
["3) Die Arbeitnehmerüberlassung wird aus den Wirtschaftgruppen (WZ 2008) 782 und 783 ermittelt."]

{"sheet":"Tab 4","index":11,"n_rows":61,"n_cols":10,"rows_kept":61,"cut":false,"hidden":false,"merged":[[61,0,61,9],[60,0,60,9],[2,0,2,9],[31,3,31,6],[31,7,31,9],[31,0,33,2],[22,0,29,9],[59,0,59,9],[57,0,57,9]]}
[null,null,null,null,null,null,null,null,null,"Frauen und Männer"]
[]
["4 Beschäftigte am Arbeitsort"]
["Deutschland (Gebietsstand: August 2020)"]
["Februar 2020, Daten mit einer Wartezeit von 6 Monaten"]
[]
[]
[]
[]
[]
[]
[]
[]
[]
[]
[]
[]
[]
[]
[]
[]
[]
["\nBeschäftigte Frauen und Männer haben unterschiedliche Schwerpunkte der Berufstätigkeiten: Während Frauen deutlich häufiger in kaufmännischen und personenbezogenen Dienstleistungsberufen arbeiten, üben Männer öfter Produktions- und MINT-Berufe aus. Auch bei der Arbeitszeit gibt es große Unterschiede: Frauen sind häufiger teilzeitbeschäftigt als Männer. Die Daten der Beschäftigungsstatistik stammen aus dem Meldeverfahren der Arbeitgeberinnen und Arbeitgeber an die Sozialversicherung. Der betrachtete Stichtag ist jeweils der Monatsletzte."]
[]
[]
[]
[]
[]
[]
[]
[]
["Merkmale",null,null,"Frauen",null,null,null,"Männer"]
[null,null,null,"Bestand","Anteil an\nMerkmals-\ngruppe\nin %","Verände-\nrung zum\nVorjahr\nin %","Anteil\nFrauen\nan allen\nPersonen\nin %","Bestand","Anteil an\nMerkmals-\ngruppe\nin %","Verände-\nrung zum\nVorjahr\nin %"]
[null,null,null,1,2,3,4,5,6,7]
["Beschäftigte insgesamt 1)",null,null,18376832,100,0.75998075470611326,48.075760368253697,19847903,100,0.90915792706114384]
["dar.:","sozialversicherungspflichtig Beschäftigte",null,15592976,84.851273603633089,1.4321383928617815,46.374893694917091,18030769,90.844705357538274,1.1468486387101073]
[null,"nach Alter"]
[null,"dav.:","unter 25 Jahre",1501590,8.1711037027492015,0.96888004889787993,43.831767325791937,1924213,9.6947924423048608,1.0755687366479805]
[null,null,"25 bis unter 55 Jahre",10673541,58.081507193405258,0.17652249005206677,46.401777376660917,12328899,62.116884589772539,-7.3699188652420755E-2]
[null,null,"55 Jahre und älter",3417845,18.598662707478635,5.7861259134835752,47.499743589814855,3777657,19.033028325460883,5.385792214357088]
[null,"nach Arbeitszeit"]
[null,"dar.:","Vollzeit",7995542,43.508815882955233,0.22558315552176911,33.451530491000874,15906330,80.141111128969143,0.52869691574295441]
[null,null,"Teilzeit",7597434,41.342457720677864,2.7336932931454783,78.147842499073988,2124439,10.703594228569134,6.0283422470568837]
[null,"nach Anforderungsniveau"]
[null,"dav.:","Helfer",2509185,13.654067251635102,1.0642582736484663,48.838435525755948,2628541,13.243419216629585,0.68577106439116076]
[null,null,"Fachkraft",9460996,51.483280687335011,0.89632575545901538,48.695985701151976,9967702,50.220428828173937,0.73946880778126278]
[null,null,"Spezialist/Experte",3547327,19.303256404585948,3.1975190659260022,39.98167121505012,5325056,26.829312900209157,2.1964815608779498]
[null,null,"ohne Angabe",75468,0.41066926007703608,-0.29461891109907601,40.807189436459787,109470,0.55154441252559527,-0.97603777510425482]
[null,"nach ausgewählten Merkmalen"]
[null,"dar.:","Ausländer",1571266,8.5502550167515281,7.3076353086843016,36.90311507266405,2686548,13.535676791648971,6.24625040289013]
[null,null,"MINT-Berufe2)",1301260,7.0809810961976467,2.4810258970811017,15.949260842472398,6857488,34.550189004853557,0.70841869515732014]
[null,null,"Arbeitnehmerüberlassung (ANÜ) 3)",195563,1.0641823356713498,-7.6243245285870787,28.61982722412716,487750,2.4574384508025862,-10.760679444676191]
["geringfügig Beschäftigte",null,null,4432782,24.121578735660204,-0.7244137234139747,58.408704207754944,3156467,15.903277036370039,0.82906539599101325]
["dar:","geringfügig entlohnte Beschäftigte",null,4352658,23.685573226114272,-0.71208690941233499,58.667373659797384,3066556,15.450277039342645,0.93853181143255249]
[null,"dav.:","ausschließlich",2718223,14.791575609985442,-2.8670799658526147,60.933984408187435,1742708,8.7803129630369519,-1.2694916368102716]
[null,null,"im Nebenjob",1634435,8.8939976161288303,3.0917398440032828,55.249447061014791,1323848,6.6699640763056927,4.0003079516735873]
[null,null,null,null,null,null,null,null,null," © Statistik der Bundesagentur für Arbeit"]
[""]
["1) Summe der sozialversicherungspflichtig und ausschließlich geringfügig Beschäftigten"]
["2) Weiterführende Hinweise zu Berufsaggregaten"]
["3) Die Arbeitnehmerüberlassung wird aus den Wirtschaftgruppen (WZ 2008) 782 und 783 ermittelt."]

{"sheet":"Tab 5","index":12,"n_rows":50,"n_cols":10,"rows_kept":50,"cut":false,"hidden":false,"merged":[[2,0,2,9],[7,0,7,2],[7,3,7,4],[7,6,7,9],[10,3,13,4],[48,0,48,9],[22,0,35,9],[49,0,49,9],[14,3,17,4],[37,0,39,2],[40,0,40,2],[37,3,37,6],[37,7,37,9]]}
[null,null,null,null,null,null,null,null,null,"Frauen und Männer"]
[]
["5 Gemeldete Bewerber für Berufsausbildungsstellen und gemeldete Berufsausbildungsstellen"]
["Deutschland (Gebietsstand: August 2020)"]
["August 2020, Berichtsjahr 2019/20"]
[]
[]
[]
[]
[]
[]
[]
[]
[]
[]
[]
[]
[]
[]
[]
[]
[]
["\nAls Bewerber für Berufsausbildungsstellen zählen Personen, die im Berichtsjahr eine individuelle Vermittlung in eine Berufsausbildungsstelle in einem anerkannten Ausbildungsberuf nach dem Berufsausbildungsgesetz (BBiG) wünschen und deren Eignung dafür geklärt wurde. Als Berufsausbildungsstellen zählen alle im Berichtsjahr zu besetzenden Berufsausbildungsstellen für anerkannte Ausbildungsberufe nach dem BBiG. Das Berichtsjahr beginnt jeweils am 1. Oktober und endet am 30. September des Folgejahres. Sowohl die Bewerber als auch die Berufsausbildungsstellen, die während des Berichtsjahres gemeldet werden, werden dabei kumuliert ausgewiesen.\n \nDie Ausbildungsmarktstatistik der Bundesagentur für Arbeit bildet zeitnah den Großteil des Ausbildungsmarktgeschehens ab. Es handelt sich aber trotzdem nur um einen Marktausschnitt. Laut Bundesinstitut für Berufsbildung (BIBB) melden drei von vier Betrieben der BA ihre Ausbildungsstellen. Rund 70 Prozent der ausbildungsinteressierten Jugendlichen sind als Bewerber gemeldet.\n"]
[]
[]
[]
[]
[]
[]
[]
[]
[]
[]
[]
[]
[]
[]
["Merkmale",null,null,"Frauen",null,null,null,"Männer"]
[null,null,null,"Anzahl","Anteil an\nMerkmals-\ngruppe\nin %","Verände-\nrung zum\nVorjahr\nin %","Anteil\nFrauen\nan allen\nPersonen\nin %","Anzahl","Anteil an\nMerkmals-\ngruppe\nin %","Verände-\nrung zum\nVorjahr\nin %"]
[null,null,null,1,2,3,4,5,6,7]
["seit Beginn des Berichtsjahres",null,null,176753,100,-8.5919520911013727,38.630820205269877,280773,100,-7.528216815806033]
["dar.:","zum 30.09. unversorgt",null,35860,20.288198785876336,10.233315914051211,35.94987468671679,63888,22.754324667970209,10.835848860206099]
["dar.:","unter 20 Jahre",null,118239,66.895045628645619,-9.8616352201257858,39.115461721174263,184030,65.544051600403179,-7.808453187854747]
[null,"unter 25 Jahre",null,165305,93.523165094793299,-8.8641162622737468,38.84675852053082,260209,92.67593393951698,-7.5052519701553022]
[null,"MINT-Berufe",null,17439,9.8663106142470003,-9.3607068607068573,11.478085735159576,134486,47.898480266977238,-7.1793385235492284]
["dar.:","Deutsche",null,148888,84.235062488331167,-9.2041151108969927,39.402640639596889,228958,81.54559020988485,-6.556527346412377]
[null,"Ausländer",null,27411,15.508081899600008,-5.4564894974649008,34.95855120520342,50998,18.163427395084287,-11.76663956123808]
[null,null,null,null,null,null,null,null,null,"© Statistik der Bundesagentur für Arbeit "]
[]
["Hinweis Grafik\nDie Angaben zu den Berufsausbildungsstellen enthalten keine Daten von den zugelassenen kommunalen Trägern (zkT). Nach Einschätzung der Statistik der BA dürften bei den zkT nur wenige ungeförderte Ausbildungsstellen nach dem Berufsausbildungsgesetz (BBiG) gemeldet sein, die nicht gleichzeitig bei den Agenturen für Arbeit oder den gemeinsamen Einrichtungen (gE) erfasst sind. "]

{"sheet":"Tab 6","index":13,"n_rows":50,"n_cols":10,"rows_kept":50,"cut":false,"hidden":false,"merged":[[49,0,49,9],[37,0,37,2],[41,0,41,2],[22,0,31,9],[33,0,35,2],[33,3,33,6],[33,7,33,9],[36,0,36,9],[40,0,40,9]]}
[null,null,null,null,null,null,null,null,null,"Frauen und Männer"]
[]
["6 Leistungsbeziehende von Arbeitslosengeld und Nichtleistungsberechtigte im Rechtskreis SGB III"]
["Deutschland (Gebietsstand: August 2020)"]
["Statistik über Arbeitslosengeld nach dem SGB III, Juni 2020, Daten mit einer Wartezeit von 2 Monaten"]
["Arbeitslosenstatistik April 2020, Daten mit einer Wartezeit von 4 Monaten"]
[]
[]
[]
[]
[]
[]
[]
[]
[]
[]
[]
[]
[]
[]
[]
[]
["\nArbeitslosigkeit und Leistungsbezug gehen nicht immer miteinander einher. So gibt es Arbeitslose, die im Rechtskreis SGB III geführt werden, aber keine Leistungen aus der Arbeitslosenversicherung erhalten (sogenannte Nichtleistungsberechtigte). \n\nDaneben können auch Leistungsbeziehende von Arbeitslosengeld zusätzlich zum Arbeitslosengeld nach dem SGB III auch Arbeitslosengeld II beziehen. Dabei handelt es sich um Leistungsbeziehende, deren Arbeitslosengeld nicht ausreicht, um den Bedarf zum Lebensunterhalt zu decken. Das Arbeitslosengeld wird um die entsprechenden Ansprüche auf Leistungen nach dem SGB II „aufgestockt“."]
[]
[]
[]
[]
[]
[]
[]
[]
[]
[]
["Merkmale",null,null,"Frauen",null,null,null,"Männer"]
[null,null,null,"Bestand","Anteil an\nMerkmals-\ngruppe\nin %","Verände-\nrung zum\nVorjahr\nin %","Anteil\nFrauen\nan allen\nPersonen\nin %","Bestand","Anteil an\nMerkmals-\ngruppe\nin %","Verände-\nrung zum\nVorjahr\nin %"]
[null,null,null,1,2,3,4,5,6,7]
["Berichtsmonat Juni 2020"]
["Leistungsbeziehende von Arbeitslosengeld",null,null,478286,100,38.973604993084535,43.084326322654569,631791,100,51.370330705039294]
["dav.:","bei Arbeitslosigkeit",null,449794,94.042894836980381,43.876529388244712,42.990241524654252,596438,94.404320416086961,56.3316305000249]
[null,"bei Weiterbildung",null,28492,5.9571051630196159,-9.6381338999714572,44.626131629232837,35353,5.5956795839130349,-1.4138315672058033]
["Berichtsmonat April 2020"]
["Arbeitslose Nichtleistungsberechtigte",null,null,86867,100,32.962407396069302,42.573514997059398,117166,100,39.388748111400609]
["nach der Dauer der Arbeitslosigkeit"]
["dav.:","unter 1 Jahr",null,70496,81.153947989455148,40.899006655607309,41.275696310738731,100290,85.596504105286513,46.33826040009923]
[null,"1 Jahr und länger",null,16371,18.846052010544856,7.0069939211713228,49.240532980419289,16876,14.403495894713483,8.7090955939191019]
[null,"dar.:","2 Jahre und länger",7295,8.3978956335547448,-6.1977626334062013,48.006054224795996,7901,6.7434238601642118,-4.1257128989200309]
[null,null,null,null,null,null,null,null,null,"© Statistik der Bundesagentur für Arbeit"]
[]
["Die Statistik über Arbeitslosengeld nach dem SGB III wurde zum 31.03.2020 revidiert. Weitere Informationen finden Sie unter folgenden Link:"]
["https://statistik.arbeitsagentur.de/Navigation/Statistik/Grundlagen/Methodik-Qualitaet/Methodenberichte/Leistungsstatistik/Methodenberichte-Leistungsstatistik-Nav.html"]

{"sheet":"Tab 7.1","index":14,"n_rows":62,"n_cols":10,"rows_kept":62,"cut":false,"hidden":false,"merged":[[22,0,32,9],[56,0,56,9],[34,0,36,2],[34,3,34,6],[34,7,34,9],[50,1,50,2],[54,1,54,2],[48,0,48,9],[52,0,52,9],[37,0,37,9],[51,1,51,2],[58,0,58,9],[59,0,59,9],[60,0,60,9],[61,0,61,9],[57,0,57,9]]}
[null,null,null,null,null,null,null,null,null,"Frauen und Männer"]
[]
["7.1 Grundsicherung für Arbeitsuchende"]
["Deutschland (Gebietsstand: August 2020)"]
["Mai 2020, Daten mit einer Wartezeit von 3 Monaten"]
[]
[]
[]
[]
[]
[]
[]
[]
[]
[]
[]
[]
[]
[]
[]
[]
[]
["\nRegelleistungsberechtigte (RLB) sind Personen mit Anspruch auf Gesamtregelleistung (Arbeitslosengeld II oder Sozialgeld). Dazu zählen Personen, die Anspruch auf Regelbedarf, Mehrbedarf, Kosten der Unterkunft oder den Zuschlag nach Bezug von Arbeitslosengeld haben. RLB sind untergliedert in erwerbsfähige Leistungsberechtigte (ELB) und nicht erwerbsfähige Leistungsberechtigte (NEF).\n\nAls ELB gelten Personen, die das 15. Lebensjahr vollendet und die Regelaltersgrenze noch nicht erreicht haben, die erwerbsfähig und hilfebedürftig sind und ihren gewöhnlichen Aufenthalt in der Bundesrepublik Deutschland haben. Innerhalb der Grundsicherungsstatistik SGB II werden Personen nur dann als ELB ausgewiesen, wenn sie Arbeitslosengeld II beziehen."]
[]
[]
[]
[]
[]
[]
[]
[]
[]
[]
[]
["Merkmale",null,null,"Frauen",null,null,null,"Männer"]
[null,null,null,"Bestand","Anteil an\nMerkmals-\ngruppe\nin %","Verände-\nrung zum\nVorjahr\nin %","Anteil\nFrauen\nan allen\nPersonen\nin %","Bestand","Anteil an\nMerkmals-\ngruppe\nin %","Verände-\nrung zum\nVorjahr\nin %"]
[null,null,null,1,2,3,4,5,6,7]
["Bestand"]
["Regelleistungsberechtigte (RLB)",null,null,2782175,"X",0.63622546015931203,49.739554188568633,2811174,"X",0.89634627808483636]
["Erwerbsfähige Leistungsberechtigte (ELB)",null,null,2020598,100,1.4896990816895883,50.248907161035895,2000536,100,1.9878738319781819]
["dav.:","unter 25 Jahre",null,352398,17.440282530221253,-1.0593226287373247,49.318369797505241,362129,18.101598771529229,-2.1585008024467833]
[null,"25 bis unter 55 Jahre",null,1313453,65.003182226251838,1.5892892362547872,51.131074635743751,1255316,62.748983272482974,2.6347181035589307]
[null,"55 Jahre und älter",null,354747,17.556535243526916,3.7687611704103618,48.078797037318139,383091,19.149417955987794,4.0064180879310518]
["dar.:","Alleinerziehende",null,473364,23.426926088217449,-2.9562265264953314,92.220832505347815,39928,1.9958651081510155,4.7484128233380662]
[null,"Aufstocker 1)2)",null,44494,2.2020213817889558,31.600118308192847,42.866364153106545,59302,2.9643055661082829,42.211031175059958]
[null,"Langzeitleistungsbezieher (LZB)",null,1388929,68.738512064250287,-4.0431737978185112,52.099425339094942,1276967,63.831243226815211,-5.0335737674682912]
["dar.:","Deutsche",null,1269717,62.838674491412938,0.57395377794817737,50.201106172909796,1259511,62.958677074544021,2.4805862212617491]
[null,"Ausländer",null,742477,36.745409032375562,3.0810026586698402,50.442515151906306,729439,36.462178136259482,1.192633059671877]
["Zugang in Regelleistungsbezug"]
["ELB",null,null,66873,100,49.557185668918002,46.496088997045021,76949,100,39.115578616238487]
["dar.:\n","mit vorherigem Regelleistungsbezug\n  innerhalb der letzten 3 Monate",null,12332,18.440925336084817,-11.5097588978186,44.513427663875248,15372,19.976867795552899,-12.604468702029681]
[null,"Vorbezug Arbeitslosengeld (ALG) nach SGB III\n  innerhalb der letzten 3 Monate 1)",null,2650,3.962735334140834,43.320713899405085,32.297379646556976,5554,7.2177676123146499,37.81637717121589]
["Abgang aus Regelleistungsbezug"]
["ELB",null,null,38361,100,-34.649063032367977,46.648588175207337,43871,100,-40.815638237595444]
["dar.:\n","mit erneutem Regelleistungsbezug\n  innerhalb der folgenden 3 Monate",null,7278,18.9723938374912,-38.075385008083039,46.002149042411979,8543,19.473000387499717,-42.894385026737972]
[null,null,null,null,null,null,null,null,null,"© Statistik der Bundesagentur für Arbeit "]
[]
["1) Aufgrund der Revision der Arbeitslosengeldstatistik können diese Daten von zuvor veröffentlichten Werten abweichen."]
["2) Aufstocker sind Leistungsbezieher, die gleichzeitig Arbeitslosengeld nach dem SGB III und Arbeitslosengeld II nach dem SGB II beziehen. Der Begriff des Aufstockers wurde im Zuge der Revision der Arbeitslosengeldstatistik in drei Punkten bezogen auf das SGB III revidiert.  In der Folge steigt die Zahl der Aufstocker um rund 10% gegenüber früheren Veröffentlichungen an."]
["a)  Nunmehr werden auch Personen, deren Arbeitslosengeld im Beginnmonat des Grundsicherungsbezugs endet, als Aufstocker gezählt. Sie können nicht aus den Aufstockern herausgerechnet werden. "]
["b) Die Definition schließt nun Personen in einer Sperrzeit, die früher enthalten waren, aus. "]
["c) Des Weiteren werden Personen, die Arbeitslosengeld bei Weiterbildung beziehen als Aufstocker gezählt."]

{"sheet":"Tab 7.2","index":15,"n_rows":48,"n_cols":12,"rows_kept":48,"cut":false,"hidden":false,"merged":[[47,0,49,11],[46,0,46,11],[7,0,7,4],[35,0,37,4],[35,5,35,8],[35,9,35,11],[25,0,33,11]]}
[null,null,null,null,null,null,null,null,null,null,null,"Frauen und Männer"]
[]
["7.2 Erwerbstätige erwerbsfähige Leistungsberechtigte (ELB)"]
["Deutschland (Gebietsstand: August 2020)"]
["Mai 2020, Daten mit einer Wartezeit von 3 Monaten"]
[]
[]
[]
[]
[]
[]
[]
[]
[]
[]
[]
[]
[]
[]
[]
[]
[]
[]
[]
[]
["\nErwerbstätige erwerbsfähige Leistungsberechtigte sind erwerbsfähige Regelleistungsberechtigte in der Grundsicherung für Arbeitsuchende, die Arbeitslosengeld II beziehen und zugleich über zu berücksichtigendes Einkommen aus abhängiger Erwerbstätigkeit (=Bruttoeinkommen) und/oder über verfügbares Einkommen aus selbständiger Tätigkeit (=Betriebsgewinn) verfügen."]
[]
[]
[]
[]
[]
[]
[]
[]
[]
["Merkmale",null,null,null,null,"Frauen",null,null,null,"Männer"]
[null,null,null,null,null,"Bestand","Anteil an\nMerkmals-\ngruppe\nin %","Verände-\nrung zum\nVorjahr\nin %","Anteil\nFrauen\nan allen\nPersonen\nin %","Bestand","Anteil an\nMerkmals-\ngruppe\nin %","Verände-\nrung zum\nVorjahr\nin %"]
[null,null,null,null,null,1,2,3,4,5,6,7]
["Erwerbsfähige Leistungsberechtigte (ELB)",null,null,null,null,2020598,"X",1.4896990816895883,50.248907161035895,2000536,"X",1.9878738319781819]
["dar.:","erwerbstätige ELB",null,null,null,460471.49170019402,100,-11.099550205187093,50.116979271080602,458313.833419904,99.999999999999986,-10.844474979878626]
[null,"dar.:","abhängig erwerbstätig",null,null,432984.25528815098,94.030632317637682,-11.990549749621382,51.025471366799842,415572.611855614,90.67424580110135,-12.055988421413666]
[null,null,"dav.:","bis 450 Euro",null,199745.260014334,43.378420513464725,-12.955642363447762,51.710134969296092,186528.45291287499,40.698848542496179,-11.992070577063496]
[null,null,null,"über 450 bis 1300 Euro 1)",null,190080.49962633901,41.279536964276936,-12.312458484284916,53.93729064848057,162326.642672602,35.418228915617178,-10.046945105474059]
[null,null,null,"über 1.300 Euro",null,43158.4956474871,9.3726748398980018,-5.6216451598157686,39.279270237663631,66717.516270127206,14.557168342985857,-16.748932123417802]
[null,null,"selbständig erwerbstätig",null,null,30511.53452021,6.626150602190938,3.7115636539363894,40.105647570840539,45566.365646632999,9.9421754972177343,1.6912401451025127]
[null,null,null,null,null,null,null,null,null,null,null,"© Statistik der Bundesagentur für Arbeit "]
[]
["1) Zum 01.07.2019 wurde die bisherige Gleitzone von Erwerbseinkommen von >450<=850 Euro in den Übergangsbereich von >450<=1300 Euro umgewandelt (\"RV-Leistungsverbesserungs- und Stabilisierungsgesetz\" zur Anhebung der Obergrenze für Midijobs)."]

{"sheet":"Tab 8.1_roh","index":16,"n_rows":113,"n_cols":61,"rows_kept":113,"cut":false,"hidden":true,"merged":[]}
[null,null,"TabSpalten",null,null,null,null,null,null,null,null,null,null,null,null,null,null,null,null,null,null,null,null,null,null,null,null,null,null,null,null,null,null,null,null,null,null,null,null,null,null,null,null,null,null,null,null,null,null,null,null,null,null,null,null,null,null,null,null,null,"XXX"]
[null,null,"Hilfsspalten"]
[null,null,"Überschrift","8.1 Bestand in ausgewählten arbeitsmarktpolitischen Instrumenten "]
[null,null,"Gebiet","Deutschland (Gebietsstand: August 2020)"]
[null,null,"BM","Mai 2020, Daten mit einer Wartezeit von 3 Monaten"]
[]
[]
[]
[null,null,"Frauen","Frauen","Frauen","Frauen","Frauen","Frauen","Männer","Männer","Männer","Männer","Frauen","Frauen","Frauen","Frauen","Frauen","Frauen","Männer","Männer","Männer","Männer","Frauen","Frauen","Frauen","Frauen","Frauen","Frauen","Männer","Männer","Männer","Männer",null,"Frauen","Frauen","Frauen","Männer","Männer","Frauen","Frauen","Frauen","Männer","Männer","Frauen","Frauen","Frauen","Männer","Männer"]
[null,"Tab/DS","Insgesamt","VJM","Anteil an\nSumme der\nInstrumente\nin %","Verände-\nrung zum\nVorjahr\nin %","Gesamt","Anteil an\nallen\nPersonen\nin %","Insgesamt","VJM","Anteil an\nSumme der\nInstrumente\nin %","Verände-\nrung zum\nVorjahr\nin %","Insgesamt","VJM","Anteil an\nSumme der\nInstrumente\nin %","Verände-\nrung zum\nVorjahr\nin %","Gesamt","Anteil an\nallen\nPersonen\nin %","Insgesamt","VJM","Anteil an\nSumme der\nInstrumente\nin %","Verände-\nrung zum\nVorjahr\nin %","Insgesamt","VJM","Anteil an\nSumme der\nInstrumente\nin %","Verände-\nrung zum\nVorjahr\nin %","Gesamt","Anteil an\nallen\nPersonen\nin %","Insgesamt","VJM","Anteil an\nSumme der\nInstrumente\nin %","Verände-\nrung zum\nVorjahr\nin %",null,"Anteil an\nSumme der\nInstrumente\nin %","Verände-\nrung zum\nVorjahr\nin %","Anteil an\nallen\nPersonen\nin %","Anteil an\nSumme der\nInstrumente\nin %","Verände-\nrung zum\nVorjahr\nin %","Anteil an\nSumme der\nInstrumente\nin %","Verände-\nrung zum\nVorjahr\nin %","Anteil an\nallen\nPersonen\nin %","Anteil an\nSumme der\nInstrumente\nin %","Verände-\nrung zum\nVorjahr\nin %","Anteil an\nSumme der\nInstrumente\nin %","Verände-\nrung zum\nVorjahr\nin %","Anteil an\nallen\nPersonen\nin %","Anteil an\nSumme der\nInstrumente\nin %","Verände-\nrung zum\nVorjahr\nin %"]
[null,null,1,0,2,3,0,4,5,0,6,7,1,0,2,3,0,4,5,0,6,7,1,0,2,3,0,4,5,0,6,7,null,2,3,4,6,7,2,3,4,6,7,2,3,4,6,7]
[null,null,1,2,3,4,5,6,7,8,9,10,1,2,3,4,5,6,7,8,9,10,1,2,3,4,5,6,7,8,9,10,null,3,4,6,9,10,3,4,6,9,10,3,4,6,9,10]
[null,null,"1Insgesamt","2Insgesamt",null,null,"5Insgesamt",null,"7Insgesamt","8Insgesamt",null,null,"1SGB III","2SGB III",null,null,"5SGB III",null,"7SGB III","8SGB III",null,null,"1SGB II","2SGB II",null,null,"5SGB II",null,"7SGB II","8SGB II",null,null,null,"3Insgesamt","4Insgesamt","6Insgesamt","9Insgesamt","10Insgesamt","3SGB III","4SGB III","6SGB III","9SGB III","10SGB III","3SGB II","4SGB II","6SGB II","9SGB II","10SGB II"]
[]
[null,"ID für Auswahl","Insgesamt",null,null,null,null,null,null,null,null,null,"SGB III",null,null,null,null,null,null,null,null,null,"SGB II"]
[null,"Summe der Instrumente mit Einmalleistungen",317342,373146,null,null,758320,null,440969,525519,null,null,171547,193804,null,null,402511,null,230957,263334,null,null,145794,179341,null,null,355807,null,210011,262183,null,null,null,100,-14.955004207468392,41.848032492878993,100,-16.088856920491935,100,-11.484283090132298,42.619207922267968,100,-12.295032164475527,100,-18.705705889896894,40.975585078427351,100,-19.899078124821212]
[null,"Aktivierung und berufliche Eingliederung, darunter",63679,96597,null,null,144282,null,80601,126600,null,null,8271,18082,null,null,19749,null,11477,23545,null,null,55408,78515,null,null,124533,null,69124,103055,null,null,null,20.066363733763573,-34.077662867376837,44.135096547039829,18.278155607310264,-36.334123222748815,4.8214192029006631,-54.258378497953764,41.880601549445537,4.9693232939464922,-51.255043533658949,38.004307447494412,-29.430045214290267,44.492624444926243,32.914466385094116,-32.925137062733491]
[null,"Maßnahmen zur Aktivierung und beruflichen Eingliederung",62491,95601,null,null,140928,null,78435,124845,null,null,8206,17964,null,null,19554,null,11347,23289,null,null,54285,77637,null,null,121374,null,67088,101556,null,null,null,19.692004209969056,-34.633528937981815,44.342501135331517,17.786964616560347,-37.174095878889823,4.7835287122479553,-54.319750612335781,41.965838191674337,4.9130357599033587,-51.277427111511876,37.234042553191486,-30.078441979983772,44.725394235997825,31.944993357490798,-33.939895230217807]
[null,"Vermittlungsbudget","X","X",null,null,"X",null,"X","X",null,null,"X","X",null,null,"X",null,"X","X",null,null,"X","X",null,null,"X",null,"X","X",null,null,null,"X","X","X","X","X","X","X","X","X","X","X","X","X","X","X"]
[null,"Berufswahl und Berufsausbildung, darunter",56603,65887,null,null,169254,null,112646,126475,null,null,50198,58820,null,null,148104,null,97902,110244,null,null,6404,7066,null,null,21148,null,14743,16229,null,null,null,17.836592698098581,-14.090791810220527,33.442636510806246,25.545106345344003,-10.934176714765764,29.261951535147801,-14.658279496769811,33.893750337600601,42.389708906852789,-11.19516708392293,4.3924990054460409,-9.3688083781488842,30.281823340268581,7.0201084705086876,-9.1564483332306388]
[null,"Berufseinstiegsbegleitung",20776,25966,null,null,50000,null,29222,36657,null,null,20776,25966,null,null,49999,null,29221,36656,null,null,"X","X",null,null,"X",null,"X","X",null,null,null,6.5468800221842676,-19.987676191943315,41.552,6.6267696822225597,-20.282619963444905,12.110966673856144,-19.987676191943315,41.55283105662113,12.652138709803124,-20.283173286774336,"X","X","X","X","X"]
[null,"Assistierte Ausbildung",2122,2721,null,null,9739,null,7617,8747,null,null,1383,1855,null,null,6859,null,5476,6317,null,null,739,866,null,null,2880,null,2141,2430,null,null,null,0.6686792167440806,-22.013965453877248,21.78868466988397,1.7273323068061472,-12.918714987995884,0.80619305496452864,-25.444743935309976,20.163289109199592,2.3710041263092263,-13.313281621022632,0.50687956980396998,-14.665127020785217,25.659722222222221,1.0194704086928781,-11.893004115226336]
[null,"Berufsvorbereitende Bildungsmaßnahmen",12576,13627,null,null,33688,null,21112,22479,null,null,12575,13626,null,null,33687,null,21112,22479,null,null,"X","X",null,null,"X",null,"X","X",null,null,null,3.9629169791581322,-7.7126293388126488,37.330800284967943,4.7876381332928171,-6.0812313715022936,7.3303526147353208,-7.713195361808312,37.328939947160627,9.1410955286048932,-6.0812313715022936,"X","X","X","X","X"]
[null,"Einstiegsqualifizierung",2896,3568,null,null,10503,null,7607,10234,null,null,1814,2163,null,null,6564,null,4750,6016,null,null,1082,1405,null,null,3939,null,2857,4218,null,null,null,0.91258011861020605,-18.834080717488789,27.573074359706752,1.7250645737001919,-25.669337502442836,1.0574361545232502,-16.134997688395746,27.635588056063376,2.0566598977298804,-21.043882978723406,0.74214302371839713,-22.989323843416365,27.468900736227468,1.3604049311702722,-32.266477003319103]
[null,"Ausbildungsbegleitende Hilfen",9767,10508,null,null,41730,null,31961,32343,null,null,8592,9444,null,null,35913,null,27319,28025,null,null,1175,1064,null,null,5817,null,4642,4317,null,null,null,3.0777520781995449,-7.0517700799390903,23.405224059429667,7.2479017799437147,-1.1810901895309645,5.0085399336624947,-9.0216010165184208,23.924484170077687,11.828608788648969,-2.5191793041926869,0.80593165699548686,10.43233082706767,20.199415506274711,2.2103604096928255,7.5283761871670185]
[null,"Berufliche Weiterbildung, darunter",91891,95578,null,null,174542,null,82651,89296,null,null,70462,69003,null,null,127130,null,56668,57197,null,null,21429,26575,null,null,47412,null,25983,32099,null,null,null,28.956457071550567,-3.8575822888112343,52.646927387104533,18.7430408940311,-7.4415427342770073,41.074457728785696,2.1144008231526179,55.425155352788479,24.536169070433026,-0.92487368218613364,14.698135725750031,-19.364063969896517,45.197418375094912,12.37220907476275,-19.0535530701891]
[null,"Förderung der beruflichen Weiterbildung",74541,81923,null,null,148500,null,73959,82392,null,null,53371,55563,null,null,101580,null,48209,50491,null,null,21170,26360,null,null,46920,null,25750,31901,null,null,null,23.48916941344039,-9.0109004797187637,50.195959595959593,16.771927278334758,-10.235217011360332,31.11159040962535,-3.9450713604377019,52.540854498917113,20.873582528349431,-4.5196173575488663,14.520487811569749,-19.688922610015169,45.11935208866155,12.261262505297342,-19.281527224851892]
[null,"Arbeitsentgeltzuschuss zur beruflichen Weiterbildung Beschäftigter",17350,13655,null,null,26042,null,8692,6904,null,null,17091,13440,null,null,25550,null,8459,6706,null,null,259,215,null,null,492,null,233,198,null,null,null,5.4672876581101777,27.059685097034048,66.623147223715534,1.9711136156963416,25.898030127462345,9.9628673191603472,27.165178571428573,66.892367906066539,3.6625865420835915,26.140769460184909,0.17764791418028175,20.465116279069772,52.642276422764226,0.11094656946540894,17.676767676767668]
[null,"Aufnahme einer Erwerbstätigkeit, darunter",38791,44771,null,null,101972,null,63181,74520,null,null,19413,23522,null,null,47871,null,28458,33798,null,null,19378,21249,null,null,54101,null,34723,40722,null,null,null,12.223720780734979,-13.356860467713471,38.04083473894795,14.327764536736144,-15.216049382716045,11.316432231400141,-17.468752657086984,40.552735476593341,12.321774183073039,-15.7997514645837,13.291356297241313,-8.8051202409525136,35.818191900334561,16.533895843551054,-14.731594715387264]
[null,"Förderung abhängiger Beschäftigung",29695,34538,null,null,81415,null,51720,61355,null,null,11312,14487,null,null,29731,null,18419,22454,null,null,18383,20051,null,null,51684,null,33301,38901,null,null,null,9.3574125076415982,-14.022236377323527,36.473622796781918,11.728715624000779,-15.703691630673944,6.5941112348219439,-21.916200731690484,38.047828865493926,7.9750776118498248,-17.970072147501558,12.608886511104709,-8.3187870929130714,35.568067487036608,15.856788453938128,-14.395516824760291]
[null,"Eingliederungszuschuss",14432,19784,null,null,41358,null,26926,36164,null,null,9083,12169,null,null,23722,null,14639,18377,null,null,5349,7615,null,null,17636,null,12287,17787,null,null,null,4.5477749557259992,-27.052163364334813,34.895304415107113,6.1060981610952236,-25.544740626036944,5.2947588707467919,-25.359520092037148,38.289351656689988,6.3384093142879401,-20.340643195298469,3.6688752623564755,-29.757058437294816,30.330006804264002,5.8506459185471238,-30.921459492888058]
[null,"Eingliederung von Langzeitarbeitslosen",3740,925,null,null,10451,null,6711,1907,null,null,"X","X",null,null,"X",null,"X","X",null,null,3740,925,null,null,10451,null,6711,1907,null,null,null,1.1785392415753351,".X",35.786049181896466,1.5218756874065977,".X","X","X","X","X","X",2.5652633167345709,".X",35.786049181896466,3.19554689992429,".X"]
[null,"Förderung der Selbständigkeit",9096,10233,null,null,20557,null,11461,13165,null,null,8101,9035,null,null,18140,null,10039,11344,null,null,995,1198,null,null,2417,null,1422,1821,null,null,null,2.8663082730933818,-11.111111111111116,44.247701512866669,2.5990489127353622,-12.943410558298519,4.7223209965781967,-10.337576092971778,44.65821389195149,4.3466965712232142,-11.50387870239774,0.6824697861366037,-16.944908180300501,41.166735622672732,0.67710738961292505,-21.911037891268535]
[null,"Beschäftigung schaffende Maßnahmen, darunter",36202,38059,null,null,93076,null,56874,60422,null,null,"X","X",null,null,"X",null,"X","X",null,null,36202,38059,null,null,93076,null,56874,60422,null,null,null,11.407881717516117,-4.8792664021650616,38.89509648029567,12.897505266810139,-5.872033365330509,"X","X","X","X","X",24.830925826851587,-4.8792664021650616,38.89509648029567,27.081438591311883,-5.872033365330509]
[null,"Arbeitsgelegenheiten",20948,30233,null,null,52540,null,31592,46650,null,null,"X","X",null,null,"X",null,"X","X",null,null,20948,30233,null,null,52540,null,31592,46650,null,null,null,6.601080222598962,-30.711474216915292,39.870574800152262,7.1642224283339644,-32.278670953912112,"X","X","X","X","X",14.368218170843793,-30.711474216915292,39.870574800152262,15.043021556013732,-32.278670953912112]
[null,"Teilhabe am Arbeitsmarkt",14776,6030,null,null,39209,null,24433,10317,null,null,"X","X",null,null,"X",null,"X","X",null,null,14776,6030,null,null,39209,null,24433,10317,null,null,null,4.6561753565553881,145.04145936981757,37.685225330918918,5.5407522977805694,136.82271978288264,"X","X","X","X","X",10.134847798949203,145.04145936981757,37.685225330918918,11.634152496773979,136.82271978288264]
[]
[]
[null,"DiaDatRoh",null,null,null,null,null,null,null,null,null,null,null,null,null,null,null,null,null,null,null,null,null,null,null,null,null,null,null,null,null,null,null,"DiaDatRohDS"]
[]
[null,null,null,null,"ID",null,"Mai 2018","2018-06-01","2018-07-01","2018-08-01","2018-09-01","Okt 2018","2018-11-01","Dez 2018","2019-01-01","2019-02-01","2019-03-01","2019-04-01","Mai 2019","2019-06-01","2019-07-01","2019-08-01","2019-09-01","Okt 2019","2019-11-01","Dez 2019","2020-01-01","2020-02-01","2020-03-01","2020-04-01","Mai 2020",null,null,null,null,"Mai 2018","2018-06-01","2018-07-01","2018-08-01","2018-09-01","Okt 2018","2018-11-01","Dez 2018","2019-01-01","2019-02-01","2019-03-01","2019-04-01","Mai 2019","2019-06-01","2019-07-01","2019-08-01","2019-09-01","Okt 2019","2019-11-01","Dez 2019","2020-01-01","2020-02-01","2020-03-01","2020-04-01","Mai 2020"]
[null,"Summe der Instrumente mit Einmalleistungen","Insgesamt","G",null,null,856652,842747,797036,759255,832727,871147,894821,879389,839908,851756,870364,892270,898682,889365,847412,807566,865298,902591,916075,897907,870957,876114,887139,801568,758320,null,null,"Insgesamt","G",856652,842747,797036,759255,832727,871147,894821,879389,839908,851756,870364,892270,898682,889365,847412,807566,865298,902591,916075,897907,870957,876114,887139,801568,758320]
[null,"Summe der Instrumente mit Einmalleistungen","SGB III","G",null,null,453350,443381,408466,378164,432161,457287,469572,463236,459945,454257,457357,460746,457150,444237,411252,378492,421376,449281,457308,450675,446610,440849,445538,415146,402511,null,null,"SGB III","G",453350,443381,408466,378164,432161,457287,469572,463236,459945,454257,457357,460746,457150,444237,411252,378492,421376,449281,457308,450675,446610,440849,445538,415146,402511]
[null,"Summe der Instrumente mit Einmalleistungen","SGB II","G",null,null,403301,399365,388569,381090,400566,413860,425248,416152,379962,397497,413005,431522,441529,445125,436157,429071,443920,453308,458765,447229,424345,435262,441599,386420,355807,null,null,"SGB II","G",403301,399365,388569,381090,400566,413860,425248,416152,379962,397497,413005,431522,441529,445125,436157,429071,443920,453308,458765,447229,424345,435262,441599,386420,355807]
[null,"Summe der Instrumente mit Einmalleistungen","Insgesamt","F","Summe der Instrumente mit EinmalleistungenInsgesamtF",null,352813,346776,324200,308223,343718,362564,374344,367539,350777,356647,363623,371065,373146,367900,347326,329450,359976,378391,386029,378034,366015,369082,373206,336634,317342,null,null,"Summe der Instrumente mit EinmalleistungenInsgesamtF",null,352813,346776,324200,308223,343718,362564,374344,367539,350777,356647,363623,371065,373146,367900,347326,329450,359976,378391,386029,378034,366015,369082,373206,336634,317342]
[null,"Summe der Instrumente mit Einmalleistungen","SGB III","F","Summe der Instrumente mit EinmalleistungenSGB IIIF",null,189561,185786,170777,159151,183342,194221,200130,196728,194351,193072,194261,195470,193804,188006,173986,160643,180892,193190,196540,192574,189687,188339,190434,177110,171547,null,null,"Summe der Instrumente mit EinmalleistungenSGB IIIF",null,189561,185786,170777,159151,183342,194221,200130,196728,194351,193072,194261,195470,193804,188006,173986,160643,180892,193190,196540,192574,189687,188339,190434,177110,171547]
[null,"Summe der Instrumente mit Einmalleistungen","SGB II","F","Summe der Instrumente mit EinmalleistungenSGB IIF",null,163252,160990,153423,149072,160376,168343,174214,170811,156426,163575,169362,175595,179341,179893,173340,168807,179084,185200,189488,185459,176327,180742,182771,159523,145794,null,null,"Summe der Instrumente mit EinmalleistungenSGB IIF",null,163252,160990,153423,149072,160376,168343,174214,170811,156426,163575,169362,175595,179341,179893,173340,168807,179084,185200,189488,185459,176327,180742,182771,159523,145794]
[null,"Summe der Instrumente mit Einmalleistungen","Insgesamt","M","Summe der Instrumente mit EinmalleistungenInsgesamtM",null,503833,495961,472828,451024,488994,508572,520468,511836,489118,495094,506727,521191,525519,521443,500065,478105,505311,524189,530033,519859,504930,507019,513921,464925,440969,null,null,"Summe der Instrumente mit EinmalleistungenInsgesamtM",null,503833,495961,472828,451024,488994,508572,520468,511836,489118,495094,506727,521191,525519,521443,500065,478105,505311,524189,530033,519859,504930,507019,513921,464925,440969]
[null,"Summe der Instrumente mit Einmalleistungen","SGB III","M","Summe der Instrumente mit EinmalleistungenSGB IIIM",null,263785,257591,237684,219007,248807,263059,269436,266495,265582,261172,263084,265265,263334,256217,237252,217841,240476,256084,260760,258092,256914,252501,255098,238030,230957,null,null,"Summe der Instrumente mit EinmalleistungenSGB IIIM",null,263785,257591,237684,219007,248807,263059,269436,266495,265582,261172,263084,265265,263334,256217,237252,217841,240476,256084,260760,258092,256914,252501,255098,238030,230957]
[null,"Summe der Instrumente mit Einmalleistungen","SGB II","M","Summe der Instrumente mit EinmalleistungenSGB IIM",null,240047,238369,235143,232016,240187,245513,251031,245340,223535,233920,243641,255924,262183,265224,262810,260261,264833,268104,269272,261765,248015,254516,258822,226894,210011,null,null,"Summe der Instrumente mit EinmalleistungenSGB IIM",null,240047,238369,235143,232016,240187,245513,251031,245340,223535,233920,243641,255924,262183,265224,262810,260261,264833,268104,269272,261765,248015,254516,258822,226894,210011]
[]
[]
[]
[null,null,"Frauen","Frauen","Frauen","Frauen","Männer","Männer","Männer"]
[null,"Tab","Insgesamt","Anteil der\nMerkmals-\ngruppe an\nInsgesamt\nin %","Verände-\nrung zum\nVorjahr\nin %","Anteil an\nallen\nPersonen\nin %","Insgesamt","Anteil der\nMerkmals-\ngruppe an\nInsgesamt\nin %","Verände-\nrung zum\nVorjahr\nin %"]
[null,null,1,2,3,4,5,6,7]
[null,{"$f":"Auswahl!A2","v":"Insgesamt"},1,3,4,6,7,9,10,"Spalte in der Tabelle Tab/DS für Insgesamt"]
[null,null,{"$f":"MATCH(C57&$B$57,$C$13:$AV$13,0)","v":1},{"$f":"MATCH(D57&$B$57,$C$13:$AV$13,0)","v":32},33,34,7,35,36,"Berechnete Spalte in Tab/DS (Merkmalsspalte+Auftreten der Merkmalsauswahl"]
[1,"Summe der Instrumente mit Einmalleistungen",{"$f":"INDEX($C$16:$AV$36,$A59,C$58)","v":317342},100,-14.955004207468392,41.848032492878993,440969,100,-16.088856920491935]
[2,"Aktivierung und berufliche Eingliederung, darunter",63679,20.066363733763573,-34.077662867376837,44.135096547039829,80601,18.278155607310264,-36.334123222748815]
[3,"Maßnahmen zur Aktivierung und beruflichen Eingliederung",62491,19.692004209969056,-34.633528937981815,44.342501135331517,78435,17.786964616560347,-37.174095878889823]
[4,"Vermittlungsbudget","X","X","X","X","X","X","X"]
[5,"Berufswahl und Berufsausbildung, darunter",56603,17.836592698098581,-14.090791810220527,33.442636510806246,112646,25.545106345344003,-10.934176714765764]
[6,"Berufseinstiegsbegleitung",20776,6.5468800221842676,-19.987676191943315,41.552,29222,6.6267696822225597,-20.282619963444905]
[7,"Assistierte Ausbildung",2122,0.6686792167440806,-22.013965453877248,21.78868466988397,7617,1.7273323068061472,-12.918714987995884]
[8,"Berufsvorbereitende Bildungsmaßnahmen",12576,3.9629169791581322,-7.7126293388126488,37.330800284967943,21112,4.7876381332928171,-6.0812313715022936]
[9,"Einstiegsqualifizierung",2896,0.91258011861020605,-18.834080717488789,27.573074359706752,7607,1.7250645737001919,-25.669337502442836]
[10,"Ausbildungsbegleitende Hilfen",9767,3.0777520781995449,-7.0517700799390903,23.405224059429667,31961,7.2479017799437147,-1.1810901895309645]
[11,"Berufliche Weiterbildung, darunter",{"$f":"INDEX($C$16:$AV$36,$A69,C$58)","v":91891},28.956457071550567,-3.8575822888112343,52.646927387104533,82651,18.7430408940311,-7.4415427342770073]
[12,"Förderung der beruflichen Weiterbildung",74541,23.48916941344039,-9.0109004797187637,50.195959595959593,73959,16.771927278334758,-10.235217011360332]
[13,"Arbeitsentgeltzuschuss zur beruflichen Weiterbildung Beschäftigter",17350,5.4672876581101777,27.059685097034048,66.623147223715534,8692,1.9711136156963416,25.898030127462345]
[14,"Aufnahme einer Erwerbstätigkeit, darunter",38791,12.223720780734979,-13.356860467713471,38.04083473894795,63181,14.327764536736144,-15.216049382716045]
[15,"Förderung abhängiger Beschäftigung",29695,9.3574125076415982,-14.022236377323527,36.473622796781918,51720,11.728715624000779,-15.703691630673944]
[16,"Eingliederungszuschuss",14432,4.5477749557259992,-27.052163364334813,34.895304415107113,26926,6.1060981610952236,-25.544740626036944]
[17,"Eingliederung von Langzeitarbeitslosen",3740,1.1785392415753351,".X",35.786049181896466,6711,1.5218756874065977,".X"]
[18,"Förderung der Selbständigkeit",9096,2.8663082730933818,-11.111111111111116,44.247701512866669,11461,2.5990489127353622,-12.943410558298519]
[19,"Beschäftigung schaffende Maßnahmen, darunter",36202,11.407881717516117,-4.8792664021650616,38.89509648029567,56874,12.897505266810139,-5.872033365330509]
[20,"Arbeitsgelegenheiten",20948,6.601080222598962,-30.711474216915292,39.870574800152262,31592,7.1642224283339644,-32.278670953912112]
[21,"Teilhabe am Arbeitsmarkt",14776,4.6561753565553881,145.04145936981757,37.685225330918918,24433,5.5407522977805694,136.82271978288264]
[]
[]
[null,"DiaDat"]
[null,null,null,null,null,null,3,4,5,6,7,8,9,10,11,12,13,14,15,16,17,18,19,20,21,22,23,24,25,26,27]
[null,null,null,null,"ID",null,{"$f":"TEXT(G41,\"MMM JJJJ\")","v":"Mai 2018"},"Jun 2018","Jul 2018","Aug 2018","Sep 2018","Okt 2018","Nov 2018","Dez 2018","Jan 2019","Feb 2019","Mrz 2019","Apr 2019","Mai 2019","Jun 2019","Jul 2019","Aug 2019","Sep 2019","Okt 2019","Nov 2019","Dez 2019","Jan 2020","Feb 2020","Mrz 2020","Apr 2020","Mai 2020"]
[null,"Summe der Instrumente mit Einmalleistungen",{"$f":"B57","v":"Insgesamt"},"F",{"$f":"B85&C85&D85","v":"Summe der Instrumente mit EinmalleistungenInsgesamtF"},"Frauen",{"$f":"VLOOKUP($E85,$E$45:$AE$50,G$83,0)","v":352813},346776,324200,308223,343718,362564,374344,367539,350777,356647,{"$f":"VLOOKUP($E85,$E$45:$AE$50,Q$83,0)","v":363623},371065,373146,367900,347326,329450,359976,378391,386029,378034,366015,369082,373206,336634,317342]
[null,"Summe der Instrumente mit Einmalleistungen",{"$f":"C85","v":"Insgesamt"},"M",{"$f":"B86&C86&D86","v":"Summe der Instrumente mit EinmalleistungenInsgesamtM"},"Männer",503833,495961,472828,451024,488994,508572,520468,511836,489118,495094,506727,521191,525519,521443,500065,478105,505311,524189,530033,519859,504930,507019,513921,464925,440969]
[]
[null,"DiaDatDS"]
[null,null,null,null,null,null,{"$f":"G84","v":"Mai 2018"},{"$f":"H84","v":"Jun 2018"},"Jul 2018","Aug 2018","Sep 2018","Okt 2018","Nov 2018","Dez 2018","Jan 2019","Feb 2019","Mrz 2019","Apr 2019","Mai 2019","Jun 2019","Jul 2019","Aug 2019","Sep 2019","Okt 2019","Nov 2019","Dez 2019","Jan 2020","Feb 2020","Mrz 2020","Apr 2020","Mai 2020"]
[null,null,null,null,null,"Frauen",{"$f":"VLOOKUP($E85,$AH$45:$BI$50,G$83,0)","v":352813},346776,324200,308223,343718,362564,374344,367539,350777,356647,363623,371065,373146,367900,347326,329450,359976,378391,386029,378034,366015,369082,373206,336634,317342]
[null,null,null,null,null,"Männer",{"$f":"VLOOKUP($E86,$AH$45:$BI$50,G$83,0)","v":503833},495961,472828,451024,488994,508572,520468,511836,489118,495094,506727,521191,525519,521443,500065,478105,505311,524189,530033,519859,504930,507019,513921,464925,440969]
[null,null,null,null,"Fallzahl",0,{"$f":"COUNTIF($G$85:$AE$86,\"<\"&$F$92)","v":0},"*",{"$f":"COUNTIF($G$90:$AE$91,\"*\")","v":0}]
[]
[null,"DiaDatenreihen",null,null,null,null,{"$f":"G84","v":"Mai 2018"},{"$f":"H84","v":"Jun 2018"},"Jul 2018","Aug 2018","Sep 2018","Okt 2018","Nov 2018","Dez 2018","Jan 2019","Feb 2019","Mrz 2019","Apr 2019","Mai 2019","Jun 2019","Jul 2019","Aug 2019","Sep 2019","Okt 2019","Nov 2019","Dez 2019","Jan 2020","Feb 2020","Mrz 2020","Apr 2020","Mai 2020"]
[null,null,null,null,null,"Frauen",{"$f":"IF(($G$92+$I$92)>0,NA(),G85)","v":352813},346776,324200,308223,343718,362564,374344,367539,350777,356647,363623,371065,373146,367900,347326,329450,359976,378391,386029,378034,366015,369082,373206,336634,317342]
[null,null,null,null,null,"Männer",{"$f":"IF(($G$92+$I$92)>0,NA(),G86)","v":503833},495961,472828,451024,488994,508572,520468,511836,489118,495094,506727,521191,525519,521443,500065,478105,505311,524189,530033,519859,504930,507019,513921,464925,440969]
[]
[null,"DiaDS, DatenBeschriftungen "]
[null,null,null,null,null,null,{"$f":"TEXT(G84,\"MMM JJJJ\")","v":"Mai 2018"},null,null,{"$f":"TEXT(J84,\"MMM JJJJ\")","v":"Aug 2018"},null,null,{"$f":"TEXT(M84,\"MMM JJJJ\")","v":"Nov 2018"},null,null,{"$f":"TEXT(P84,\"MMM JJJJ\")","v":"Feb 2019"},null,null,{"$f":"TEXT(S84,\"MMM JJJJ\")","v":"Mai 2019"},null,null,{"$f":"TEXT(V84,\"MMM JJJJ\")","v":"Aug 2019"},null,null,{"$f":"TEXT(Y84,\"MMM JJJJ\")","v":"Nov 2019"},null,null,{"$f":"TEXT(AB84,\"MMM JJJJ\")","v":"Feb 2020"},null,null,{"$f":"TEXT(AE84,\"MMM JJJJ\")","v":"Mai 2020"}]
[null,null,null,null,null,"Frauen",{"$f":"IF(($G$92+$I$92)>0,\"\",G85)","v":352813},null,null,{"$f":"IF(($G$92+$I$92)>0,\"\",J85)","v":308223},null,null,{"$f":"IF(($G$92+$I$92)>0,\"\",M85)","v":374344},null,null,{"$f":"IF(($G$92+$I$92)>0,\"\",P85)","v":356647},null,null,{"$f":"IF(($G$92+$I$92)>0,\"\",S85)","v":373146},null,null,{"$f":"IF(($G$92+$I$92)>0,\"\",V85)","v":329450},null,null,{"$f":"IF(($G$92+$I$92)>0,\"\",Y85)","v":386029},null,null,{"$f":"IF(($G$92+$I$92)>0,\"\",AB85)","v":369082},null,null,{"$f":"IF(($G$92+$I$92)>0,\"\",AE85)","v":317342}]
[null,null,null,null,null,"Männer",{"$f":"IF(($G$92+$I$92)>0,\"\",G86)","v":503833},null,null,{"$f":"IF(($G$92+$I$92)>0,\"\",J86)","v":451024},null,null,{"$f":"IF(($G$92+$I$92)>0,\"\",M86)","v":520468},null,null,{"$f":"IF(($G$92+$I$92)>0,\"\",P86)","v":495094},null,null,{"$f":"IF(($G$92+$I$92)>0,\"\",S86)","v":525519},null,null,{"$f":"IF(($G$92+$I$92)>0,\"\",V86)","v":478105},null,null,{"$f":"IF(($G$92+$I$92)>0,\"\",Y86)","v":530033},null,null,{"$f":"IF(($G$92+$I$92)>0,\"\",AB86)","v":507019},null,null,{"$f":"IF(($G$92+$I$92)>0,\"\",AE86)","v":440969}]
[]
[]
[]
[]
[null,{"$f":"MID(Auswahl!F5,5,1000)&  \" (Summe der Intrumente) \"&CHAR(10)&TEXT($G$84,\"MMMM JJJJ\") &\" - \" &TEXT($AE$84,\"MMMM JJJJ\")","v":"Bestand in ausgewählten arbeitsmarktpolitischen Instrumenten  (Summe der Intrumente) \nMai 2018 - Mai 2020"}]
[]
["FZ","Auf Grund der zu geringen Fallzahlen in einigen Berichtmonaten wird auf die grafische Darstellung verzichtet.",null,null,null,null,null,null,null,"nicht eingeschlossen"]
["NV","Daten für die Maßnahmeart- und Rechtskreisauswahl stehen nicht zur Verfügung"]
["*","Auf Grund von primären oder sekundärem Datenschutz kann keine Grafik dargestellt werden."]
["ZR","Auf Grund von unvollständigen Datenlieferungen im Berichtszeitraum kann keine Grafik dargestellt werden."]
[null,{"$f":"IF(I92>0,B110,IF(G92>0,B108,IF(ISNA(G85),B109,\"\")))","v":""}]
[null,"Text bei sinnloser Kombi"]

{"sheet":"Tab 8.1","index":17,"n_rows":61,"n_cols":10,"rows_kept":61,"cut":false,"hidden":false,"merged":[[59,0,59,9],[4,0,4,3],[22,0,30,9],[2,0,2,9],[7,0,7,3],[7,4,7,5],[7,6,7,9],[10,4,13,5],[38,1,38,2],[47,1,47,2],[55,1,55,2],[14,4,17,5],[32,0,34,2],[37,1,37,2],[35,0,35,2]]}
[null,null,null,null,null,null,null,null,null,"Frauen und Männer"]
[]
[{"$f":"Auswahl!F5","v":"8.1 Bestand in ausgewählten arbeitsmarktpolitischen Instrumenten "}]
[{"$f":"'Tab 8.1_roh'!D4","v":"Deutschland (Gebietsstand: August 2020)"}]
[{"$f":"'Tab 8.1_roh'!D5","v":"Mai 2020, Daten mit einer Wartezeit von 3 Monaten"}]
[]
[]
[]
[]
[]
[]
[]
[]
[]
[]
[]
[]
[]
[]
[]
[]
[]
["\nDie Förderstatistik berichtet über Förderungen bzw. Teilnahmen von Personen an Maßnahmen der aktiven Arbeitsmarktförderung nach dem SGB III und Leistungen zur Eingliederung des Bundes nach dem SGB II. Es erfolgt eine Zählung von Förderfällen bzw. Teilnahmen, nicht von Personen. Folglich wird eine Person, die in einem Zeitraum oder an einem Zeitpunkt mehrere Förderleistungen erhält, mehrfach gezählt."]
[]
[]
[]
[]
[]
[]
[]
[]
[]
["Ausgewählte Instrumente\nder Arbeitsmarktpolitik",null,null,"Frauen",null,null,null,"Männer"]
[null,null,null,"Bestand","Anteil an\nSumme der\nInstrumente\nin %","Verände-\nrung zum\nVorjahr\nin %","Anteil\nFrauen\nan allen\nPersonen\nin %","Bestand","Anteil an\nSumme der\nInstrumente\nin %","Verände-\nrung zum\nVorjahr\nin %"]
[null,null,null,1,2,3,4,5,6,7]
["Summe der Instrumente",null,null,{"$f":"'Tab 8.1_roh'!C59","v":317342},{"$f":"'Tab 8.1_roh'!D59","v":100},{"$f":"'Tab 8.1_roh'!E59","v":-14.955004207468392},{"$f":"'Tab 8.1_roh'!F59","v":41.848032492878993},{"$f":"'Tab 8.1_roh'!G59","v":440969},{"$f":"'Tab 8.1_roh'!H59","v":100},{"$f":"'Tab 8.1_roh'!I59","v":-16.088856920491935}]
["Aktivierung und berufliche Eingliederung",null,null,{"$f":"'Tab 8.1_roh'!C60","v":63679},{"$f":"'Tab 8.1_roh'!D60","v":20.066363733763573},{"$f":"'Tab 8.1_roh'!E60","v":-34.077662867376837},{"$f":"'Tab 8.1_roh'!F60","v":44.135096547039829},{"$f":"'Tab 8.1_roh'!G60","v":80601},{"$f":"'Tab 8.1_roh'!H60","v":18.278155607310264},{"$f":"'Tab 8.1_roh'!I60","v":-36.334123222748815}]
["dar.:\n","Maßnahmen zur Aktivierung und\n beruflichen Eingliederung",null,{"$f":"'Tab 8.1_roh'!C61","v":62491},{"$f":"'Tab 8.1_roh'!D61","v":19.692004209969056},{"$f":"'Tab 8.1_roh'!E61","v":-34.633528937981815},{"$f":"'Tab 8.1_roh'!F61","v":44.342501135331517},{"$f":"'Tab 8.1_roh'!G61","v":78435},{"$f":"'Tab 8.1_roh'!H61","v":17.786964616560347},{"$f":"'Tab 8.1_roh'!I61","v":-37.174095878889823}]
[null,"Vermittlungsbudget",null,{"$f":"'Tab 8.1_roh'!C62","v":"X"},{"$f":"'Tab 8.1_roh'!D62","v":"X"},{"$f":"'Tab 8.1_roh'!E62","v":"X"},{"$f":"'Tab 8.1_roh'!F62","v":"X"},{"$f":"'Tab 8.1_roh'!G62","v":"X"},{"$f":"'Tab 8.1_roh'!H62","v":"X"},{"$f":"'Tab 8.1_roh'!I62","v":"X"}]
["Berufswahl und Berufsausbildung 1)",null,null,{"$f":"'Tab 8.1_roh'!C63","v":56603},{"$f":"'Tab 8.1_roh'!D63","v":17.836592698098581},{"$f":"'Tab 8.1_roh'!E63","v":-14.090791810220527},{"$f":"'Tab 8.1_roh'!F63","v":33.442636510806246},{"$f":"'Tab 8.1_roh'!G63","v":112646},{"$f":"'Tab 8.1_roh'!H63","v":25.545106345344003},{"$f":"'Tab 8.1_roh'!I63","v":-10.934176714765764}]
["dar.:","Berufseinstiegsbegleitung",null,{"$f":"'Tab 8.1_roh'!C64","v":20776},{"$f":"'Tab 8.1_roh'!D64","v":6.5468800221842676},{"$f":"'Tab 8.1_roh'!E64","v":-19.987676191943315},{"$f":"'Tab 8.1_roh'!F64","v":41.552},{"$f":"'Tab 8.1_roh'!G64","v":29222},{"$f":"'Tab 8.1_roh'!H64","v":6.6267696822225597},{"$f":"'Tab 8.1_roh'!I64","v":-20.282619963444905}]
[null,"Assistierte Ausbildung",null,{"$f":"'Tab 8.1_roh'!C65","v":2122},{"$f":"'Tab 8.1_roh'!D65","v":0.6686792167440806},{"$f":"'Tab 8.1_roh'!E65","v":-22.013965453877248},{"$f":"'Tab 8.1_roh'!F65","v":21.78868466988397},{"$f":"'Tab 8.1_roh'!G65","v":7617},{"$f":"'Tab 8.1_roh'!H65","v":1.7273323068061472},{"$f":"'Tab 8.1_roh'!I65","v":-12.918714987995884}]
[null,"Berufsvorbereitende Bildungsmaßnahmen",null,{"$f":"'Tab 8.1_roh'!C66","v":12576},{"$f":"'Tab 8.1_roh'!D66","v":3.9629169791581322},{"$f":"'Tab 8.1_roh'!E66","v":-7.7126293388126488},{"$f":"'Tab 8.1_roh'!F66","v":37.330800284967943},{"$f":"'Tab 8.1_roh'!G66","v":21112},{"$f":"'Tab 8.1_roh'!H66","v":4.7876381332928171},{"$f":"'Tab 8.1_roh'!I66","v":-6.0812313715022936}]
[null,"Einstiegsqualifizierung",null,{"$f":"'Tab 8.1_roh'!C67","v":2896},{"$f":"'Tab 8.1_roh'!D67","v":0.91258011861020605},{"$f":"'Tab 8.1_roh'!E67","v":-18.834080717488789},{"$f":"'Tab 8.1_roh'!F67","v":27.573074359706752},{"$f":"'Tab 8.1_roh'!G67","v":7607},{"$f":"'Tab 8.1_roh'!H67","v":1.7250645737001919},{"$f":"'Tab 8.1_roh'!I67","v":-25.669337502442836}]
[null,"Ausbildungsbegleitende Hilfen",null,{"$f":"'Tab 8.1_roh'!C68","v":9767},{"$f":"'Tab 8.1_roh'!D68","v":3.0777520781995449},{"$f":"'Tab 8.1_roh'!E68","v":-7.0517700799390903},{"$f":"'Tab 8.1_roh'!F68","v":23.405224059429667},{"$f":"'Tab 8.1_roh'!G68","v":31961},{"$f":"'Tab 8.1_roh'!H68","v":7.2479017799437147},{"$f":"'Tab 8.1_roh'!I68","v":-1.1810901895309645}]
["Berufliche Weiterbildung",null,null,{"$f":"'Tab 8.1_roh'!C69","v":91891},{"$f":"'Tab 8.1_roh'!D69","v":28.956457071550567},{"$f":"'Tab 8.1_roh'!E69","v":-3.8575822888112343},{"$f":"'Tab 8.1_roh'!F69","v":52.646927387104533},{"$f":"'Tab 8.1_roh'!G69","v":82651},{"$f":"'Tab 8.1_roh'!H69","v":18.7430408940311},{"$f":"'Tab 8.1_roh'!I69","v":-7.4415427342770073}]
["dar.:","Förderung der berufl. Weiterbildung",null,{"$f":"'Tab 8.1_roh'!C70","v":74541},{"$f":"'Tab 8.1_roh'!D70","v":23.48916941344039},{"$f":"'Tab 8.1_roh'!E70","v":-9.0109004797187637},{"$f":"'Tab 8.1_roh'!F70","v":50.195959595959593},{"$f":"'Tab 8.1_roh'!G70","v":73959},{"$f":"'Tab 8.1_roh'!H70","v":16.771927278334758},{"$f":"'Tab 8.1_roh'!I70","v":-10.235217011360332}]
[null,"Arbeitsentgeltzuschuss zur\n berufl. Weiterbildung Beschäftigter",null,{"$f":"'Tab 8.1_roh'!C71","v":17350},{"$f":"'Tab 8.1_roh'!D71","v":5.4672876581101777},{"$f":"'Tab 8.1_roh'!E71","v":27.059685097034048},{"$f":"'Tab 8.1_roh'!F71","v":66.623147223715534},{"$f":"'Tab 8.1_roh'!G71","v":8692},{"$f":"'Tab 8.1_roh'!H71","v":1.9711136156963416},{"$f":"'Tab 8.1_roh'!I71","v":25.898030127462345}]
["Aufnahme einer Erwerbstätigkeit",null,null,{"$f":"'Tab 8.1_roh'!C72","v":38791},{"$f":"'Tab 8.1_roh'!D72","v":12.223720780734979},{"$f":"'Tab 8.1_roh'!E72","v":-13.356860467713471},{"$f":"'Tab 8.1_roh'!F72","v":38.04083473894795},{"$f":"'Tab 8.1_roh'!G72","v":63181},{"$f":"'Tab 8.1_roh'!H72","v":14.327764536736144},{"$f":"'Tab 8.1_roh'!I72","v":-15.216049382716045}]
["dar.:","Förderung abhängiger Beschäftigung",null,{"$f":"'Tab 8.1_roh'!C73","v":29695},{"$f":"'Tab 8.1_roh'!D73","v":9.3574125076415982},{"$f":"'Tab 8.1_roh'!E73","v":-14.022236377323527},{"$f":"'Tab 8.1_roh'!F73","v":36.473622796781918},{"$f":"'Tab 8.1_roh'!G73","v":51720},{"$f":"'Tab 8.1_roh'!H73","v":11.728715624000779},{"$f":"'Tab 8.1_roh'!I73","v":-15.703691630673944}]
[null,"dar.:","Eingliederungszuschuss",{"$f":"'Tab 8.1_roh'!C74","v":14432},{"$f":"'Tab 8.1_roh'!D74","v":4.5477749557259992},{"$f":"'Tab 8.1_roh'!E74","v":-27.052163364334813},{"$f":"'Tab 8.1_roh'!F74","v":34.895304415107113},{"$f":"'Tab 8.1_roh'!G74","v":26926},{"$f":"'Tab 8.1_roh'!H74","v":6.1060981610952236},{"$f":"'Tab 8.1_roh'!I74","v":-25.544740626036944}]
[null,null,"Eingliederung von Langzeitarbeitslosen",{"$f":"'Tab 8.1_roh'!C75","v":3740},{"$f":"'Tab 8.1_roh'!D75","v":1.1785392415753351},{"$f":"'Tab 8.1_roh'!E75","v":".X"},{"$f":"'Tab 8.1_roh'!F75","v":35.786049181896466},{"$f":"'Tab 8.1_roh'!G75","v":6711},{"$f":"'Tab 8.1_roh'!H75","v":1.5218756874065977},{"$f":"'Tab 8.1_roh'!I75","v":".X"}]
[null,"Förderung der Selbständigkeit",null,{"$f":"'Tab 8.1_roh'!C76","v":9096},{"$f":"'Tab 8.1_roh'!D76","v":2.8663082730933818},{"$f":"'Tab 8.1_roh'!E76","v":-11.111111111111116},{"$f":"'Tab 8.1_roh'!F76","v":44.247701512866669},{"$f":"'Tab 8.1_roh'!G76","v":11461},{"$f":"'Tab 8.1_roh'!H76","v":2.5990489127353622},{"$f":"'Tab 8.1_roh'!I76","v":-12.943410558298519}]
["Beschäftigung schaffende Maßnahmen",null,null,{"$f":"'Tab 8.1_roh'!C77","v":36202},{"$f":"'Tab 8.1_roh'!D77","v":11.407881717516117},{"$f":"'Tab 8.1_roh'!E77","v":-4.8792664021650616},{"$f":"'Tab 8.1_roh'!F77","v":38.89509648029567},{"$f":"'Tab 8.1_roh'!G77","v":56874},{"$f":"'Tab 8.1_roh'!H77","v":12.897505266810139},{"$f":"'Tab 8.1_roh'!I77","v":-5.872033365330509}]
["dar.:","Arbeitsgelegenheiten",null,{"$f":"'Tab 8.1_roh'!C78","v":20948},{"$f":"'Tab 8.1_roh'!D78","v":6.601080222598962},{"$f":"'Tab 8.1_roh'!E78","v":-30.711474216915292},{"$f":"'Tab 8.1_roh'!F78","v":39.870574800152262},{"$f":"'Tab 8.1_roh'!G78","v":31592},{"$f":"'Tab 8.1_roh'!H78","v":7.1642224283339644},{"$f":"'Tab 8.1_roh'!I78","v":-32.278670953912112}]
[null,"Teilhabe am Arbeitsmarkt",null,{"$f":"'Tab 8.1_roh'!C79","v":14776},{"$f":"'Tab 8.1_roh'!D79","v":4.6561753565553881},{"$f":"'Tab 8.1_roh'!E79","v":145.04145936981757},{"$f":"'Tab 8.1_roh'!F79","v":37.685225330918918},{"$f":"'Tab 8.1_roh'!G79","v":24433},{"$f":"'Tab 8.1_roh'!H79","v":5.5407522977805694},{"$f":"'Tab 8.1_roh'!I79","v":136.82271978288264}]
[null,null,null,null,null,null,null,null,null,"© Statistik der Bundesagentur für Arbeit"]
[]
["1) Ohne Ergebnisse zu Teilnahmen an Berufsorientierungsmaßnahmen."]
["2) Die Förderungen zur Teilhabe am Arbeitsmarkt sind insgesamt bundesweit übererfasst. Für einzelne Jobcenter fällt die Übererfassung deutlich höher aus. Näheres siehe unter folgendem Link: "]
["Förderung zur Teilhabe am Arbeitsmarkt - Übererfassung"]

{"sheet":"Tab 8.2_roh","index":18,"n_rows":111,"n_cols":61,"rows_kept":111,"cut":false,"hidden":true,"merged":[]}
[null,null,"TabSpalten",null,null,null,null,null,null,null,null,null,null,null,null,null,null,null,null,null,null,null,null,null,null,null,null,null,null,null,null,null,null,null,null,null,null,null,null,null,null,null,null,null,null,null,null,null,null,null,null,null,null,null,null,null,null,null,null,null,"XXX"]
[null,null,"Hilfsspalten"]
[null,null,"Überschrift","8.2 Eintritte in ausgewählte arbeitsmarktpolitische Instrumente "]
[null,null,"Gebiet","Deutschland (Gebietsstand: August 2020)"]
[null,null,"BM","Mai 2020, Daten mit einer Wartezeit von 3 Monaten"]
[]
[]
[]
[null,null,"Frauen","Frauen","Frauen","Frauen","Frauen","Frauen","Männer","Männer","Männer","Männer","Frauen","Frauen","Frauen","Frauen","Frauen","Frauen","Männer","Männer","Männer","Männer","Frauen","Frauen","Frauen","Frauen","Frauen","Frauen","Männer","Männer","Männer","Männer",null,"Frauen","Frauen","Frauen","Männer","Männer","Frauen","Frauen","Frauen","Männer","Männer","Frauen","Frauen","Frauen","Männer","Männer"]
[null,"Tab/DS","Insgesamt","VJM","Anteil der\nMerkmals-\ngruppe an\nInsgesamt\nin %","Verände-\nrung zum\nVorjahr\nin %","Gesamt","Anteil an\nallen\nPersonen\nin %","Insgesamt","VJM","Anteil der\nMerkmals-\ngruppe an\nInsgesamt\nin %","Verände-\nrung zum\nVorjahr\nin %","Insgesamt","VJM","Anteil der\nMerkmals-\ngruppe an\nInsgesamt\nin %","Verände-\nrung zum\nVorjahr\nin %","Gesamt","Anteil an\nallen\nPersonen\nin %","Insgesamt","VJM","Anteil der\nMerkmals-\ngruppe an\nInsgesamt\nin %","Verände-\nrung zum\nVorjahr\nin %","Insgesamt","VJM","Anteil der\nMerkmals-\ngruppe an\nInsgesamt\nin %","Verände-\nrung zum\nVorjahr\nin %","Gesamt","Anteil an\nallen\nPersonen\nin %","Insgesamt","VJM","Anteil der\nMerkmals-\ngruppe an\nInsgesamt\nin %","Verände-\nrung zum\nVorjahr\nin %",null,"Anteil der\nMerkmals-\ngruppe an\nInsgesamt\nin %","Verände-\nrung zum\nVorjahr\nin %","Anteil an\nallen\nPersonen\nin %","Anteil der\nMerkmals-\ngruppe an\nInsgesamt\nin %","Verände-\nrung zum\nVorjahr\nin %","Anteil der\nMerkmals-\ngruppe an\nInsgesamt\nin %","Verände-\nrung zum\nVorjahr\nin %","Anteil an\nallen\nPersonen\nin %","Anteil der\nMerkmals-\ngruppe an\nInsgesamt\nin %","Verände-\nrung zum\nVorjahr\nin %","Anteil der\nMerkmals-\ngruppe an\nInsgesamt\nin %","Verände-\nrung zum\nVorjahr\nin %","Anteil an\nallen\nPersonen\nin %","Anteil der\nMerkmals-\ngruppe an\nInsgesamt\nin %","Verände-\nrung zum\nVorjahr\nin %"]
[null,null,1,0,2,3,0,4,5,0,6,7,1,0,2,3,0,4,5,0,6,7,1,0,2,3,0,4,5,0,6,7,null,2,3,4,6,7,2,3,4,6,7,2,3,4,6,7]
[null,null,1,2,3,4,5,6,7,8,9,10,1,2,3,4,5,6,7,8,9,10,1,2,3,4,5,6,7,8,9,10,null,3,4,6,9,10,3,4,6,9,10,3,4,6,9,10]
[null,null,"1Insgesamt","2Insgesamt",null,null,"5Insgesamt",null,"7Insgesamt","8Insgesamt",null,null,"1SGB III","2SGB III",null,null,"5SGB III",null,"7SGB III","8SGB III",null,null,"1SGB II","2SGB II",null,null,"5SGB II",null,"7SGB II","8SGB II",null,null,null,"3Insgesamt","4Insgesamt","6Insgesamt","9Insgesamt","10Insgesamt","3SGB III","4SGB III","6SGB III","9SGB III","10SGB III","3SGB II","4SGB II","6SGB II","9SGB II","10SGB II"]
[]
[null,"ID für Auswahl","Insgesamt",null,null,null,null,null,null,null,null,null,"SGB III",null,null,null,null,null,null,null,null,null,"SGB II"]
[null,"Summe der Instrumente mit Einmalleistungen",39300,110493,null,null,95478,null,56176,160209,null,null,20160,44908,null,null,46569,null,26407,57022,null,null,19140,65584,null,null,48909,null,29769,103187,null,null,null,100,-64.432135972414557,41.161314648400676,100,-64.935802607843513,100,-55.108221252338119,43.290601043612703,100,-53.689803935323212,100,-70.816052695779462,39.133901735876833,100,-71.150435616889723]
[null,"Aktivierung und berufliche Eingliederung, darunter",25946,78181,null,null,61341,null,35393,109112,null,null,12439,30603,null,null,28420,null,15979,36970,null,null,13507,47578,null,null,32921,null,19414,72142,null,null,null,66.020356234096695,-66.812908507182044,42.297973622862358,63.003773853602965,-67.562687880343148,61.701388888888886,-59.353658138091035,43.768472906403943,60.510470708524252,-56.778469028942389,70.569487983281093,-71.610828534196486,41.028522827374623,65.215492626557818,-73.089185218042189]
[null,"Maßnahmen zur Aktivierung und beruflichen Eingliederung",13549,50670,null,null,33105,null,19555,71912,null,null,5819,20445,null,null,14216,null,8396,25691,null,null,7730,30225,null,null,18889,null,11159,46221,null,null,null,34.475826972010175,-73.26031182159069,40.927352363691284,34.810239248077465,-72.807041940149062,28.864087301587301,-71.53827341648325,40.932751828925156,31.79459991668876,-67.319294694640149,40.386624869383489,-74.425144747725398,40.923288686537141,37.48530350364473,-75.857294303455134]
[null,"Vermittlungsbudget",12272,27277,null,null,27868,null,15595,36752,null,null,6600,10102,null,null,14142,null,7541,11175,null,null,5672,17175,null,null,13726,null,8054,25577,null,null,null,31.226463104325703,-55.009715144627336,44.036170518157022,27.760965536884079,-57.566935132781879,32.738095238095241,-34.666402692536138,46.669495120916423,28.556822054758207,-32.519015659955251,29.634273772204807,-66.975254730713246,41.323036572927293,27.054990090362459,-68.510771396176253]
[null,"Berufswahl und Berufsausbildung, darunter",537,1538,null,null,1624,null,1087,3412,null,null,457,1345,null,null,1381,null,924,2967,null,null,80,192,null,null,243,null,163,445,null,null,null,1.366412213740458,-65.084525357607276,33.066502463054185,1.9349900313301056,-68.141852286049229,2.2668650793650791,-66.022304832713758,33.091962346125996,3.499072215700382,-68.857431749241655,0.41797283176593525,-58.333333333333329,32.921810699588477,0.54754946420773287,-63.370786516853926]
[null,"Berufseinstiegsbegleitung",158,170,null,null,367,null,209,204,null,null,158,170,null,null,367,null,209,204,null,null,"X","X",null,null,"X",null,"X","X",null,null,null,0.4020356234096692,-7.0588235294117618,43.051771117166211,0.37204500142409569,2.450980392156854,0.78373015873015872,-7.0588235294117618,43.051771117166211,0.79145681069413421,2.450980392156854,"X","X","X","X","X"]
[null,"Assistierte Ausbildung",50,149,null,null,153,null,103,317,null,null,20,85,null,null,80,null,60,200,null,null,30,64,null,null,73,null,43,117,null,null,null,0.1272264631043257,-66.442953020134226,32.679738562091501,0.18335232127598974,-67.50788643533123,9.9206349206349201E-2,-76.470588235294116,25,0.22721248153898588,-70,0.15673981191222569,-53.125,41.095890410958901,0.1444455641775001,-63.247863247863243]
[null,"Berufsvorbereitende Bildungsmaßnahmen",106,576,null,null,296,null,190,1083,null,null,106,575,null,null,296,null,190,1083,null,null,"X","X",null,null,"X",null,"X","X",null,null,null,0.26972010178117051,-81.597222222222214,35.810810810810814,0.33822272856735974,-82.456140350877192,0.52579365079365081,-81.565217391304344,35.810810810810814,0.71950619154012196,-82.456140350877192,"X","X","X","X","X"]
[null,"Einstiegsqualifizierung",27,76,null,null,108,null,81,132,null,null,13,27,null,null,59,null,46,47,null,null,14,49,null,null,49,null,35,85,null,null,null,6.8702290076335881E-2,-64.473684210526315,25,0.14418968954713757,-38.636363636363633,6.4484126984126977E-2,-51.851851851851862,22.033898305084744,0.17419623584655583,-2.1276595744680882,7.314524555903866E-2,-71.428571428571431,28.571428571428569,0.11757197084215124,-58.82352941176471]
[null,"Ausbildungsbegleitende Hilfen",161,486,null,null,596,null,435,1505,null,null,132,432,null,null,495,null,363,1306,null,null,29,54,null,null,101,null,72,199,null,null,null,0.4096692111959287,-66.872427983539097,27.013422818791948,0.77435203645684991,-71.096345514950173,0.65476190476190477,-69.444444444444443,26.666666666666668,1.3746355133108645,-72.205206738131693,0.15151515151515152,-46.296296296296291,28.71287128712871,0.24186234001813967,-63.819095477386931]
[null,"Berufliche Weiterbildung, darunter",6081,12027,null,null,13502,null,7421,15963,null,null,4900,7991,null,null,10418,null,5518,9469,null,null,1181,4036,null,null,3084,null,1903,6494,null,null,null,15.47328244274809,-49.438762783736593,45.03777218189898,13.210267729991457,-53.511244753492448,24.305555555555554,-38.681016143161052,47.033979650604721,20.89597455220207,-41.725631006442079,6.1703239289446188,-70.738354806739352,38.29442282749676,6.3925560146461082,-70.696027101940246]
[null,"Förderung der beruflichen Weiterbildung",5569,11456,null,null,12361,null,6792,15225,null,null,4397,7436,null,null,9296,null,4899,8769,null,null,1172,4020,null,null,3065,null,1893,6456,null,null,null,14.170483460559796,-51.387918994413404,45.052989240352723,12.090572486471091,-55.389162561576356,21.810515873015873,-40.868746637977402,47.299913941480206,18.551899117658195,-44.132740335271983,6.1233019853709507,-70.845771144278615,38.238172920065253,6.358964022976922,-70.678438661710047]
[null,"Arbeitsentgeltzuschuss zur beruflichen Weiterbildung Beschäftigter",512,571,null,null,1141,null,629,738,null,null,503,555,null,null,1122,null,619,700,null,null,9,16,null,null,19,null,10,38,null,null,null,1.302798982188295,-10.332749562171628,44.872918492550397,1.1196952435203644,-14.769647696476962,2.4950396825396828,-9.3693693693693731,44.830659536541887,2.3440754345438708,-11.571428571428577,4.7021943573667714E-2,-43.75,47.368421052631575,3.3591991669186069E-2,-73.684210526315795]
[null,"Aufnahme einer Erwerbstätigkeit, darunter",3270,7775,null,null,9397,null,6127,14096,null,null,1761,3613,null,null,4663,null,2902,5404,null,null,1509,4162,null,null,4734,null,3225,8692,null,null,null,8.3206106870228993,-57.942122186495169,34.798339895711401,10.906792936485331,-56.533768444948926,8.7351190476190474,-51.259341267644622,37.765387089856318,10.989510357102283,-46.29903774981495,7.8840125391849538,-63.743392599711676,31.875792141951838,10.833417313312506,-62.896916705016118]
[null,"Förderung abhängiger Beschäftigung",2587,6592,null,null,7777,null,5190,12464,null,null,1212,2720,null,null,3356,null,2144,4251,null,null,1375,3872,null,null,4421,null,3046,8213,null,null,null,6.5826972010178118,-60.755461165048544,33.264755046933267,9.238820848761037,-58.360077021822846,6.0119047619047619,-55.441176470588239,36.11442193087008,8.1190593403264284,-49.564808280404613,7.1839080459770113,-64.48863636363636,31.101560732865867,10.232120662434076,-62.91245586265677]
[null,"Eingliederungszuschuss",1602,4035,null,null,4914,null,3312,7617,null,null,1129,2534,null,null,3111,null,1982,3934,null,null,473,1501,null,null,1803,null,1330,3683,null,null,null,4.0763358778625953,-60.297397769516728,32.600732600732599,5.8957561948162915,-56.518314296967311,5.600198412698413,-55.445935280189417,36.290581806493087,7.5055856401711667,-49.618708693441796,2.4712643678160919,-68.48767488341106,26.234054353854685,4.4677348920017472,-63.88813467282106]
[null,"Eingliederung von Langzeitarbeitslosen",123,360,null,null,360,null,237,687,null,null,"X","X",null,null,"X",null,"X","X",null,null,123,360,null,null,360,null,237,687,null,null,null,0.31297709923664124,-65.833333333333329,34.166666666666664,0.4218883508971803,-65.502183406113531,"X","X","X","X","X",0.64263322884012541,-65.833333333333329,34.166666666666664,0.79613020255970968,-65.502183406113531]
[null,"Förderung der Selbständigkeit",683,1183,null,null,1620,null,937,1632,null,null,549,893,null,null,1307,null,758,1153,null,null,134,290,null,null,313,null,179,479,null,null,null,1.7379134860050889,-42.265426880811496,42.160493827160494,1.6679720877242949,-42.585784313725497,2.7232142857142856,-38.521836506159012,42.004590665646518,2.870451016775855,-34.25845620121423,0.70010449320794155,-53.793103448275858,42.811501597444092,0.60129665087843065,-62.630480167014611]
[null,"Beschäftigung schaffende Maßnahmen, darunter",2133,7702,null,null,6179,null,4046,12712,null,null,"X","X",null,null,"X",null,"X","X",null,null,2133,7702,null,null,6179,null,4046,12712,null,null,null,5.4274809160305342,-72.305894572838227,34.520148891406379,7.202363998860724,-68.171806167400888,"X","X","X","X","X",11.144200626959247,-72.305894572838227,34.520148891406379,13.591319829352683,-68.171806167400888]
[null,"Arbeitsgelegenheiten",1807,6084,null,null,5204,null,3397,10035,null,null,"X","X",null,null,"X",null,"X","X",null,null,1807,6084,null,null,5204,null,3397,10035,null,null,null,4.5979643765903306,-70.299145299145295,34.723289777094543,6.0470663628595842,-66.148480318883912,"X","X","X","X","X",9.4409613375130608,-70.299145299145295,34.723289777094543,11.411199570022507,-66.148480318883912]
[null,"Teilhabe am Arbeitsmarkt",326,1618,null,null,975,null,649,2677,null,null,"X","X",null,null,"X",null,"X","X",null,null,326,1618,null,null,975,null,649,2677,null,null,null,0.82951653944020354,-79.851668726823235,33.435897435897438,1.1552976360011393,-75.756443780351134,"X","X","X","X","X",1.7032392894461859,-79.851668726823235,33.435897435897438,2.1801202593301756,-75.756443780351134]
[]
[]
[null,"DiaDatRoh",null,null,null,null,null,null,null,null,null,null,null,null,null,null,null,null,null,null,null,null,null,null,null,null,null,null,null,null,null,null,null,"DiaDatRohDS"]
[]
[null,null,null,null,"ID",null,"Mai 2018","2018-06-01","2018-07-01","2018-08-01","2018-09-01","Okt 2018","2018-11-01","Dez 2018","2019-01-01","2019-02-01","2019-03-01","2019-04-01","Mai 2019","2019-06-01","2019-07-01","2019-08-01","2019-09-01","Okt 2019","2019-11-01","Dez 2019","2020-01-01","2020-02-01","2020-03-01","2020-04-01","Mai 2020",null,null,null,null,"Mai 2018","2018-06-01","2018-07-01","2018-08-01","2018-09-01","Okt 2018","2018-11-01","Dez 2018","2019-01-01","2019-02-01","2019-03-01","2019-04-01","Mai 2019","2019-06-01","2019-07-01","2019-08-01","2019-09-01","Okt 2019","2019-11-01","Dez 2019","2020-01-01","2020-02-01","2020-03-01","2020-04-01","Mai 2020"]
[null,"Summe der Instrumente mit Einmalleistungen","Insgesamt","G",null,null,286067,240863,262505,274587,346376,290857,279638,246609,229569,292388,287260,298517,270706,261308,237530,271721,334024,303703,256292,217964,206616,266170,262227,122671,95478,null,null,"Insgesamt","G",286067,240863,262505,274587,346376,290857,279638,246609,229569,292388,287260,298517,270706,261308,237530,271721,334024,303703,256292,217964,206616,266170,262227,122671,95478]
[null,"Summe der Instrumente mit Einmalleistungen","SGB III","G",null,null,115855,96577,102407,115193,170810,125078,114066,98000,85658,119720,115250,112534,101931,98890,88216,109160,156065,131360,101857,87455,77808,110483,110211,52771,46569,null,null,"SGB III","G",115855,96577,102407,115193,170810,125078,114066,98000,85658,119720,115250,112534,101931,98890,88216,109160,156065,131360,101857,87455,77808,110483,110211,52771,46569]
[null,"Summe der Instrumente mit Einmalleistungen","SGB II","G",null,null,170211,144286,160098,159394,175566,165779,165571,148609,143911,172667,172010,185983,168774,162418,149313,162561,177959,172342,154435,130508,128808,155686,152016,69900,48909,null,null,"SGB II","G",170211,144286,160098,159394,175566,165779,165571,148609,143911,172667,172010,185983,168774,162418,149313,162561,177959,172342,154435,130508,128808,155686,152016,69900,48909]
[null,"Summe der Instrumente mit Einmalleistungen","Insgesamt","F","Summe der Instrumente mit EinmalleistungenInsgesamtF",null,115993,98064,104922,109829,145516,123168,117936,102840,95743,121349,117096,120698,110493,106302,94697,108186,142589,128367,108088,89943,86475,109515,106129,49584,39300,null,null,"Summe der Instrumente mit EinmalleistungenInsgesamtF",null,115993,98064,104922,109829,145516,123168,117936,102840,95743,121349,117096,120698,110493,106302,94697,108186,142589,128367,108088,89943,86475,109515,106129,49584,39300]
[null,"Summe der Instrumente mit Einmalleistungen","SGB III","F","Summe der Instrumente mit EinmalleistungenSGB IIIF",null,51429,43284,46156,51388,75903,56989,52550,44444,38063,53123,50032,49144,44908,43469,38628,47503,69453,58869,45238,37657,33398,46657,45847,22273,20160,null,null,"Summe der Instrumente mit EinmalleistungenSGB IIIF",null,51429,43284,46156,51388,75903,56989,52550,44444,38063,53123,50032,49144,44908,43469,38628,47503,69453,58869,45238,37657,33398,46657,45847,22273,20160]
[null,"Summe der Instrumente mit Einmalleistungen","SGB II","F","Summe der Instrumente mit EinmalleistungenSGB IIF",null,64564,54780,58766,58441,69613,66179,65386,58396,57680,68226,67064,71554,65584,62833,56069,60683,73136,69498,62850,52286,53077,62858,60282,27311,19140,null,null,"Summe der Instrumente mit EinmalleistungenSGB IIF",null,64564,54780,58766,58441,69613,66179,65386,58396,57680,68226,67064,71554,65584,62833,56069,60683,73136,69498,62850,52286,53077,62858,60282,27311,19140]
[null,"Summe der Instrumente mit Einmalleistungen","Insgesamt","M","Summe der Instrumente mit EinmalleistungenInsgesamtM",null,170069,142795,157582,164749,200850,167686,161701,143761,133824,171035,170162,177815,160209,154998,142832,163532,191432,175333,148200,128013,120136,156645,156098,73083,56176,null,null,"Summe der Instrumente mit EinmalleistungenInsgesamtM",null,170069,142795,157582,164749,200850,167686,161701,143761,133824,171035,170162,177815,160209,154998,142832,163532,191432,175333,148200,128013,120136,156645,156098,73083,56176]
[null,"Summe der Instrumente mit Einmalleistungen","SGB III","M","Summe der Instrumente mit EinmalleistungenSGB IIIM",null,64426,53293,56250,63804,94900,68087,61516,53549,47595,66596,65218,63390,57022,55419,49588,61657,86610,72491,56617,49795,44410,63825,64364,30498,26407,null,null,"Summe der Instrumente mit EinmalleistungenSGB IIIM",null,64426,53293,56250,63804,94900,68087,61516,53549,47595,66596,65218,63390,57022,55419,49588,61657,86610,72491,56617,49795,44410,63825,64364,30498,26407]
[null,"Summe der Instrumente mit Einmalleistungen","SGB II","M","Summe der Instrumente mit EinmalleistungenSGB IIM",null,105642,89502,101332,100945,105950,99599,100184,90212,86229,104438,104944,114425,103187,99579,93243,101875,104822,102841,91583,78217,75726,92819,91734,42585,29769,null,null,"Summe der Instrumente mit EinmalleistungenSGB IIM",null,105642,89502,101332,100945,105950,99599,100184,90212,86229,104438,104944,114425,103187,99579,93243,101875,104822,102841,91583,78217,75726,92819,91734,42585,29769]
[]
[]
[]
[]
[null,null,"Frauen","Frauen","Frauen","Frauen","Männer","Männer","Männer"]
[null,"Tab","Insgesamt","Anteil der\nMerkmals-\ngruppe an\nInsgesamt\nin %","Verände-\nrung zum\nVorjahr\nin %","Anteil an\nallen\nPersonen\nin %","Insgesamt","Anteil der\nMerkmals-\ngruppe an\nInsgesamt\nin %","Verände-\nrung zum\nVorjahr\nin %"]
[null,null,1,2,3,4,5,6,7]
[null,{"$f":"Auswahl!A2","v":"Insgesamt"},1,3,4,6,7,9,10,"Spalte in der Tabelle Tab/DS für Insgesamt"]
[null,null,{"$f":"MATCH(C58&$B$58,$C$13:$AV$13,0)","v":1},{"$f":"MATCH(D58&$B$58,$C$13:$AV$13,0)","v":32},33,34,7,35,36,"Berechnete Spalte in Tab/DS (Merkmalsspalte+Auftreten der Merkmalsauswahl"]
[1,"Summe der Instrumente mit Einmalleistungen",{"$f":"INDEX($C$16:$AV$36,$A60,C$59)","v":39300},100,-64.432135972414557,41.161314648400676,56176,100,-64.935802607843513]
[2,"Aktivierung und berufliche Eingliederung, darunter",25946,66.020356234096695,-66.812908507182044,42.297973622862358,35393,63.003773853602965,-67.562687880343148]
[3,"Maßnahmen zur Aktivierung und beruflichen Eingliederung",13549,34.475826972010175,-73.26031182159069,40.927352363691284,19555,34.810239248077465,-72.807041940149062]
[4,"Vermittlungsbudget",12272,31.226463104325703,-55.009715144627336,44.036170518157022,15595,27.760965536884079,-57.566935132781879]
[5,"Berufswahl und Berufsausbildung, darunter",537,1.366412213740458,-65.084525357607276,33.066502463054185,1087,1.9349900313301056,-68.141852286049229]
[6,"Berufseinstiegsbegleitung",158,0.4020356234096692,-7.0588235294117618,43.051771117166211,209,0.37204500142409569,2.450980392156854]
[7,"Assistierte Ausbildung",50,0.1272264631043257,-66.442953020134226,32.679738562091501,103,0.18335232127598974,-67.50788643533123]
[8,"Berufsvorbereitende Bildungsmaßnahmen",106,0.26972010178117051,-81.597222222222214,35.810810810810814,190,0.33822272856735974,-82.456140350877192]
[9,"Einstiegsqualifizierung",27,6.8702290076335881E-2,-64.473684210526315,25,81,0.14418968954713757,-38.636363636363633]
[10,"Ausbildungsbegleitende Hilfen",161,0.4096692111959287,-66.872427983539097,27.013422818791948,435,0.77435203645684991,-71.096345514950173]
[11,"Berufliche Weiterbildung, darunter",{"$f":"INDEX($C$16:$AV$36,$A70,C$59)","v":6081},15.47328244274809,-49.438762783736593,45.03777218189898,7421,13.210267729991457,-53.511244753492448]
[12,"Förderung der beruflichen Weiterbildung",5569,14.170483460559796,-51.387918994413404,45.052989240352723,6792,12.090572486471091,-55.389162561576356]
[13,"Arbeitsentgeltzuschuss zur beruflichen Weiterbildung Beschäftigter",512,1.302798982188295,-10.332749562171628,44.872918492550397,629,1.1196952435203644,-14.769647696476962]
[14,"Aufnahme einer Erwerbstätigkeit, darunter",3270,8.3206106870228993,-57.942122186495169,34.798339895711401,6127,10.906792936485331,-56.533768444948926]
[15,"Förderung abhängiger Beschäftigung",2587,6.5826972010178118,-60.755461165048544,33.264755046933267,5190,9.238820848761037,-58.360077021822846]
[16,"Eingliederungszuschuss",1602,4.0763358778625953,-60.297397769516728,32.600732600732599,3312,5.8957561948162915,-56.518314296967311]
[17,"Eingliederung von Langzeitarbeitslosen",123,0.31297709923664124,-65.833333333333329,34.166666666666664,237,0.4218883508971803,-65.502183406113531]
[18,"Förderung der Selbständigkeit",683,1.7379134860050889,-42.265426880811496,42.160493827160494,937,1.6679720877242949,-42.585784313725497]
[19,"Beschäftigung schaffende Maßnahmen, darunter",2133,5.4274809160305342,-72.305894572838227,34.520148891406379,4046,7.202363998860724,-68.171806167400888]
[20,"Arbeitsgelegenheiten",1807,4.5979643765903306,-70.299145299145295,34.723289777094543,3397,6.0470663628595842,-66.148480318883912]
[21,"Teilhabe am Arbeitsmarkt",326,0.82951653944020354,-79.851668726823235,33.435897435897438,649,1.1552976360011393,-75.756443780351134]
[]
[]
[null,"DiaDat"]
[null,null,null,null,null,null,3,4,5,6,7,8,9,10,11,12,13,14,15,16,17,18,19,20,21,22,23,24,25,26,27]
[null,null,null,null,"ID",null,{"$f":"TEXT(G41,\"MMM JJJJ\")","v":"Mai 2018"},"Jun 2018","Jul 2018","Aug 2018","Sep 2018","Okt 2018","Nov 2018","Dez 2018","Jan 2019","Feb 2019","Mrz 2019","Apr 2019","Mai 2019","Jun 2019","Jul 2019","Aug 2019","Sep 2019","Okt 2019","Nov 2019","Dez 2019","Jan 2020","Feb 2020","Mrz 2020","Apr 2020","Mai 2020"]
[null,"Summe der Instrumente mit Einmalleistungen",{"$f":"B58","v":"Insgesamt"},"F",{"$f":"B86&C86&D86","v":"Summe der Instrumente mit EinmalleistungenInsgesamtF"},"Frauen",{"$f":"VLOOKUP($E86,$E$45:$AE$50,G$84,0)","v":115993},98064,104922,109829,145516,123168,117936,102840,95743,121349,{"$f":"VLOOKUP($E86,$E$45:$AE$50,Q$84,0)","v":117096},120698,110493,106302,94697,108186,142589,128367,108088,89943,86475,109515,106129,49584,39300]
[null,"Summe der Instrumente mit Einmalleistungen",{"$f":"C86","v":"Insgesamt"},"M",{"$f":"B87&C87&D87","v":"Summe der Instrumente mit EinmalleistungenInsgesamtM"},"Männer",170069,142795,157582,164749,200850,167686,161701,143761,133824,171035,170162,177815,160209,154998,142832,163532,191432,175333,148200,128013,120136,156645,156098,73083,56176]
[]
[null,"DiaDatDS"]
[null,null,null,null,null,null,{"$f":"G85","v":"Mai 2018"},{"$f":"H85","v":"Jun 2018"},"Jul 2018","Aug 2018","Sep 2018","Okt 2018","Nov 2018","Dez 2018","Jan 2019","Feb 2019","Mrz 2019","Apr 2019","Mai 2019","Jun 2019","Jul 2019","Aug 2019","Sep 2019","Okt 2019","Nov 2019","Dez 2019","Jan 2020","Feb 2020","Mrz 2020","Apr 2020","Mai 2020"]
[null,null,null,null,null,"Frauen",{"$f":"VLOOKUP($E86,$AH$45:$BI$50,G$84,0)","v":115993},98064,104922,109829,145516,123168,117936,102840,95743,121349,117096,120698,110493,106302,94697,108186,142589,128367,108088,89943,86475,109515,106129,49584,39300]
[null,null,null,null,null,"Männer",{"$f":"VLOOKUP($E87,$AH$45:$BI$50,G$84,0)","v":170069},142795,157582,164749,200850,167686,161701,143761,133824,171035,170162,177815,160209,154998,142832,163532,191432,175333,148200,128013,120136,156645,156098,73083,56176]
[null,null,null,null,"Fallzahl",0,{"$f":"COUNTIF($G$86:$AE$87,\"<\"&$F$93)","v":0},"*",{"$f":"COUNTIF($G$91:$AE$92,\"*\")","v":0}]
[]
[null,"DiaDatenreihen",null,null,null,null,{"$f":"G85","v":"Mai 2018"},{"$f":"H85","v":"Jun 2018"},"Jul 2018","Aug 2018","Sep 2018","Okt 2018","Nov 2018","Dez 2018","Jan 2019","Feb 2019","Mrz 2019","Apr 2019","Mai 2019","Jun 2019","Jul 2019","Aug 2019","Sep 2019","Okt 2019","Nov 2019","Dez 2019","Jan 2020","Feb 2020","Mrz 2020","Apr 2020","Mai 2020"]
[null,null,null,null,null,"Frauen",{"$f":"IF(($G$93+$I$93)>0,NA(),G86)","v":115993},98064,104922,109829,145516,123168,117936,102840,95743,121349,117096,120698,110493,106302,94697,108186,142589,128367,108088,89943,86475,109515,106129,49584,39300]
[null,null,null,null,null,"Männer",{"$f":"IF(($G$93+$I$93)>0,NA(),G87)","v":170069},142795,157582,164749,200850,167686,161701,143761,133824,171035,170162,177815,160209,154998,142832,163532,191432,175333,148200,128013,120136,156645,156098,73083,56176]
[]
[null,"DiaDS, DatenBeschriftungen "]
[null,null,null,null,null,null,{"$f":"TEXT(G85,\"MMM JJJJ\")","v":"Mai 2018"},null,null,{"$f":"TEXT(J85,\"MMM JJJJ\")","v":"Aug 2018"},null,null,{"$f":"TEXT(M85,\"MMM JJJJ\")","v":"Nov 2018"},null,null,{"$f":"TEXT(P85,\"MMM JJJJ\")","v":"Feb 2019"},null,null,{"$f":"TEXT(S85,\"MMM JJJJ\")","v":"Mai 2019"},null,null,{"$f":"TEXT(V85,\"MMM JJJJ\")","v":"Aug 2019"},null,null,{"$f":"TEXT(Y85,\"MMM JJJJ\")","v":"Nov 2019"},null,null,{"$f":"TEXT(AB85,\"MMM JJJJ\")","v":"Feb 2020"},null,null,{"$f":"TEXT(AE85,\"MMM JJJJ\")","v":"Mai 2020"}]
[null,null,null,null,null,"Frauen",{"$f":"IF(($G$93+$I$93)>0,\"\",G86)","v":115993},null,null,{"$f":"IF(($G$93+$I$93)>0,\"\",J86)","v":109829},null,null,{"$f":"IF(($G$93+$I$93)>0,\"\",M86)","v":117936},null,null,{"$f":"IF(($G$93+$I$93)>0,\"\",P86)","v":121349},null,null,{"$f":"IF(($G$93+$I$93)>0,\"\",S86)","v":110493},null,null,{"$f":"IF(($G$93+$I$93)>0,\"\",V86)","v":108186},null,null,{"$f":"IF(($G$93+$I$93)>0,\"\",Y86)","v":108088},null,null,{"$f":"IF(($G$93+$I$93)>0,\"\",AB86)","v":109515},null,null,{"$f":"IF(($G$93+$I$93)>0,\"\",AE86)","v":39300}]
[null,null,null,null,null,"Männer",{"$f":"IF(($G$93+$I$93)>0,\"\",G87)","v":170069},null,null,{"$f":"IF(($G$93+$I$93)>0,\"\",J87)","v":164749},null,null,{"$f":"IF(($G$93+$I$93)>0,\"\",M87)","v":161701},null,null,{"$f":"IF(($G$93+$I$93)>0,\"\",P87)","v":171035},null,null,{"$f":"IF(($G$93+$I$93)>0,\"\",S87)","v":160209},null,null,{"$f":"IF(($G$93+$I$93)>0,\"\",V87)","v":163532},null,null,{"$f":"IF(($G$93+$I$93)>0,\"\",Y87)","v":148200},null,null,{"$f":"IF(($G$93+$I$93)>0,\"\",AB87)","v":156645},null,null,{"$f":"IF(($G$93+$I$93)>0,\"\",AE87)","v":56176}]
[]
[null,{"$f":"MID(Auswahl!F6,5,1000)& \" (Summe der Instrumente) \" &CHAR(10)& TEXT($G$85,\"MMMM JJJJ\") &\" - \" &TEXT($AE$85,\"MMMM JJJJ\")","v":"Eintritte in ausgewählte arbeitsmarktpolitische Instrumente  (Summe der Instrumente) \nMai 2018 - Mai 2020"}]
[]
["FZ","Auf Grund der zu geringen Fallzahl in einigen Berichtmonaten wird auf die grafische Darstellung verzichtet."]
["NV","Daten für die Maßnahmeart- und Rechtskreisauswahl stehen nicht zur Verfügung"]
["*","Auf Grund von primären oder sekundärem Datenschutz kann keine Grafik dargestellt werden."]
["ZR","Auf Grund von unvollständigen Datenlieferungen im Berichtszeitrau kann keine Grafik dargestellt werden.",null,null,null,null,null,null,null,null,"nicht eingeschlossen"]
[null,{"$f":"IF(I93>0,B108,IF(G93>0,B106,IF(ISNA(G86),B107,\"\")))","v":""}]
[null,"Text bei sinnloser Kombi"]

{"sheet":"Tab 8.2","index":19,"n_rows":61,"n_cols":10,"rows_kept":61,"cut":false,"hidden":false,"merged":[[59,0,59,9],[58,0,58,9],[38,1,38,2],[47,1,47,2],[55,1,55,2],[32,0,34,2],[37,1,37,2],[35,0,35,2],[2,0,2,9],[7,0,7,3],[7,4,7,5],[7,6,7,9],[22,0,30,9],[4,0,4,3]]}
[null,null,null,null,null,null,null,null,null,"Frauen und Männer"]
[]
[{"$f":"Auswahl!F6","v":"8.2 Eintritte in ausgewählte arbeitsmarktpolitische Instrumente "}]
[{"$f":"'Tab 8.2_roh'!D4","v":"Deutschland (Gebietsstand: August 2020)"}]
[{"$f":"'Tab 8.2_roh'!D5","v":"Mai 2020, Daten mit einer Wartezeit von 3 Monaten"}]
[]
[]
[]
[]
[]
[]
[]
[]
[]
[]
[]
[]
[]
[]
[]
[]
[]
["\nEinmalleistungen sind einmalig bewilligte oder ausgezahlte Förderleistungen. Dazu gehören beispielsweise Förderungen aus dem Vermittlungsbudget, Vermittlungsgutscheine oder auch Sachgüter im Rahmen von Leistungen zur Eingliederung von Selbständigen.\n\nEinmalleistungen erstrecken sich nicht über einen Zeitraum; wie etwa die Teilnahme an einer beruflichen Weiterbildung. Sie sind daher nicht bestandswirksam und so berichtet die Statistik der BA ausschließlich über Bewilligungen bzw. Eintritte.\n"]
[]
[]
[]
[]
[]
[]
[]
[]
[]
["Ausgewählte Instrumente\nder Arbeitsmarktpolitik",null,null,"Frauen",null,null,null,"Männer"]
[null,null,null,"Eintritte","Anteil an\nSumme der\nInstrumente\nin %","Verände-\nrung zum\nVorjahr\nin %","Anteil\nFrauen\nan allen\nPersonen\nin %","Eintritte","Anteil an\nSumme der\nInstrumente\nin %","Verände-\nrung zum\nVorjahr\nin %"]
[null,null,null,1,2,3,4,5,6,7]
["Summe der Instrumente",null,null,{"$f":"'Tab 8.2_roh'!C60","v":39300},{"$f":"'Tab 8.2_roh'!D60","v":100},{"$f":"'Tab 8.2_roh'!E60","v":-64.432135972414557},{"$f":"'Tab 8.2_roh'!F60","v":41.161314648400676},{"$f":"'Tab 8.2_roh'!G60","v":56176},{"$f":"'Tab 8.2_roh'!H60","v":100},{"$f":"'Tab 8.2_roh'!I60","v":-64.935802607843513}]
["Aktivierung und berufliche Eingliederung",null,null,{"$f":"'Tab 8.2_roh'!C61","v":25946},{"$f":"'Tab 8.2_roh'!D61","v":66.020356234096695},{"$f":"'Tab 8.2_roh'!E61","v":-66.812908507182044},{"$f":"'Tab 8.2_roh'!F61","v":42.297973622862358},{"$f":"'Tab 8.2_roh'!G61","v":35393},{"$f":"'Tab 8.2_roh'!H61","v":63.003773853602965},{"$f":"'Tab 8.2_roh'!I61","v":-67.562687880343148}]
["dar.:\n","Maßnahmen zur Aktivierung und\n beruflichen Eingliederung",null,{"$f":"'Tab 8.2_roh'!C62","v":13549},{"$f":"'Tab 8.2_roh'!D62","v":34.475826972010175},{"$f":"'Tab 8.2_roh'!E62","v":-73.26031182159069},{"$f":"'Tab 8.2_roh'!F62","v":40.927352363691284},{"$f":"'Tab 8.2_roh'!G62","v":19555},{"$f":"'Tab 8.2_roh'!H62","v":34.810239248077465},{"$f":"'Tab 8.2_roh'!I62","v":-72.807041940149062}]
[null,"Vermittlungsbudget",null,{"$f":"'Tab 8.2_roh'!C63","v":12272},{"$f":"'Tab 8.2_roh'!D63","v":31.226463104325703},{"$f":"'Tab 8.2_roh'!E63","v":-55.009715144627336},{"$f":"'Tab 8.2_roh'!F63","v":44.036170518157022},{"$f":"'Tab 8.2_roh'!G63","v":15595},{"$f":"'Tab 8.2_roh'!H63","v":27.760965536884079},{"$f":"'Tab 8.2_roh'!I63","v":-57.566935132781879}]
["Berufswahl und Berufsausbildung 1)",null,null,{"$f":"'Tab 8.2_roh'!C64","v":537},{"$f":"'Tab 8.2_roh'!D64","v":1.366412213740458},{"$f":"'Tab 8.2_roh'!E64","v":-65.084525357607276},{"$f":"'Tab 8.2_roh'!F64","v":33.066502463054185},{"$f":"'Tab 8.2_roh'!G64","v":1087},{"$f":"'Tab 8.2_roh'!H64","v":1.9349900313301056},{"$f":"'Tab 8.2_roh'!I64","v":-68.141852286049229}]
["dar.:","Berufseinstiegsbegleitung",null,{"$f":"'Tab 8.2_roh'!C65","v":158},{"$f":"'Tab 8.2_roh'!D65","v":0.4020356234096692},{"$f":"'Tab 8.2_roh'!E65","v":-7.0588235294117618},{"$f":"'Tab 8.2_roh'!F65","v":43.051771117166211},{"$f":"'Tab 8.2_roh'!G65","v":209},{"$f":"'Tab 8.2_roh'!H65","v":0.37204500142409569},{"$f":"'Tab 8.2_roh'!I65","v":2.450980392156854}]
[null,"Assistierte Ausbildung",null,{"$f":"'Tab 8.2_roh'!C66","v":50},{"$f":"'Tab 8.2_roh'!D66","v":0.1272264631043257},{"$f":"'Tab 8.2_roh'!E66","v":-66.442953020134226},{"$f":"'Tab 8.2_roh'!F66","v":32.679738562091501},{"$f":"'Tab 8.2_roh'!G66","v":103},{"$f":"'Tab 8.2_roh'!H66","v":0.18335232127598974},{"$f":"'Tab 8.2_roh'!I66","v":-67.50788643533123}]
[null,"Berufsvorbereitende Bildungsmaßnahmen",null,{"$f":"'Tab 8.2_roh'!C67","v":106},{"$f":"'Tab 8.2_roh'!D67","v":0.26972010178117051},{"$f":"'Tab 8.2_roh'!E67","v":-81.597222222222214},{"$f":"'Tab 8.2_roh'!F67","v":35.810810810810814},{"$f":"'Tab 8.2_roh'!G67","v":190},{"$f":"'Tab 8.2_roh'!H67","v":0.33822272856735974},{"$f":"'Tab 8.2_roh'!I67","v":-82.456140350877192}]
[null,"Einstiegsqualifizierung",null,{"$f":"'Tab 8.2_roh'!C68","v":27},{"$f":"'Tab 8.2_roh'!D68","v":6.8702290076335881E-2},{"$f":"'Tab 8.2_roh'!E68","v":-64.473684210526315},{"$f":"'Tab 8.2_roh'!F68","v":25},{"$f":"'Tab 8.2_roh'!G68","v":81},{"$f":"'Tab 8.2_roh'!H68","v":0.14418968954713757},{"$f":"'Tab 8.2_roh'!I68","v":-38.636363636363633}]
[null,"Ausbildungsbegleitende Hilfen",null,{"$f":"'Tab 8.2_roh'!C69","v":161},{"$f":"'Tab 8.2_roh'!D69","v":0.4096692111959287},{"$f":"'Tab 8.2_roh'!E69","v":-66.872427983539097},{"$f":"'Tab 8.2_roh'!F69","v":27.013422818791948},{"$f":"'Tab 8.2_roh'!G69","v":435},{"$f":"'Tab 8.2_roh'!H69","v":0.77435203645684991},{"$f":"'Tab 8.2_roh'!I69","v":-71.096345514950173}]
["Berufliche Weiterbildung",null,null,{"$f":"'Tab 8.2_roh'!C70","v":6081},{"$f":"'Tab 8.2_roh'!D70","v":15.47328244274809},{"$f":"'Tab 8.2_roh'!E70","v":-49.438762783736593},{"$f":"'Tab 8.2_roh'!F70","v":45.03777218189898},{"$f":"'Tab 8.2_roh'!G70","v":7421},{"$f":"'Tab 8.2_roh'!H70","v":13.210267729991457},{"$f":"'Tab 8.2_roh'!I70","v":-53.511244753492448}]
["dar.:","Förderung der beruflichen Weiterbildung",null,{"$f":"'Tab 8.2_roh'!C71","v":5569},{"$f":"'Tab 8.2_roh'!D71","v":14.170483460559796},{"$f":"'Tab 8.2_roh'!E71","v":-51.387918994413404},{"$f":"'Tab 8.2_roh'!F71","v":45.052989240352723},{"$f":"'Tab 8.2_roh'!G71","v":6792},{"$f":"'Tab 8.2_roh'!H71","v":12.090572486471091},{"$f":"'Tab 8.2_roh'!I71","v":-55.389162561576356}]
[null,"Arbeitsentgeltzuschuss zur berufl.\n   Weiterbildung Beschäftigter",null,{"$f":"'Tab 8.2_roh'!C72","v":512},{"$f":"'Tab 8.2_roh'!D72","v":1.302798982188295},{"$f":"'Tab 8.2_roh'!E72","v":-10.332749562171628},{"$f":"'Tab 8.2_roh'!F72","v":44.872918492550397},{"$f":"'Tab 8.2_roh'!G72","v":629},{"$f":"'Tab 8.2_roh'!H72","v":1.1196952435203644},{"$f":"'Tab 8.2_roh'!I72","v":-14.769647696476962}]
["Aufnahme einer Erwerbstätigkeit",null,null,{"$f":"'Tab 8.2_roh'!C73","v":3270},{"$f":"'Tab 8.2_roh'!D73","v":8.3206106870228993},{"$f":"'Tab 8.2_roh'!E73","v":-57.942122186495169},{"$f":"'Tab 8.2_roh'!F73","v":34.798339895711401},{"$f":"'Tab 8.2_roh'!G73","v":6127},{"$f":"'Tab 8.2_roh'!H73","v":10.906792936485331},{"$f":"'Tab 8.2_roh'!I73","v":-56.533768444948926}]
["dar.:","Förderung abhängiger Beschäftigung",null,{"$f":"'Tab 8.2_roh'!C74","v":2587},{"$f":"'Tab 8.2_roh'!D74","v":6.5826972010178118},{"$f":"'Tab 8.2_roh'!E74","v":-60.755461165048544},{"$f":"'Tab 8.2_roh'!F74","v":33.264755046933267},{"$f":"'Tab 8.2_roh'!G74","v":5190},{"$f":"'Tab 8.2_roh'!H74","v":9.238820848761037},{"$f":"'Tab 8.2_roh'!I74","v":-58.360077021822846}]
[null,"dar.:","Eingliederungszuschuss",{"$f":"'Tab 8.2_roh'!C75","v":1602},{"$f":"'Tab 8.2_roh'!D75","v":4.0763358778625953},{"$f":"'Tab 8.2_roh'!E75","v":-60.297397769516728},{"$f":"'Tab 8.2_roh'!F75","v":32.600732600732599},{"$f":"'Tab 8.2_roh'!G75","v":3312},{"$f":"'Tab 8.2_roh'!H75","v":5.8957561948162915},{"$f":"'Tab 8.2_roh'!I75","v":-56.518314296967311}]
[null,null,"Eingliederung von Langzeitarbeitslosen",{"$f":"'Tab 8.2_roh'!C76","v":123},{"$f":"'Tab 8.2_roh'!D76","v":0.31297709923664124},{"$f":"'Tab 8.2_roh'!E76","v":-65.833333333333329},{"$f":"'Tab 8.2_roh'!F76","v":34.166666666666664},{"$f":"'Tab 8.2_roh'!G76","v":237},{"$f":"'Tab 8.2_roh'!H76","v":0.4218883508971803},{"$f":"'Tab 8.2_roh'!I76","v":-65.502183406113531}]
[null,"Förderung der Selbständigkeit",null,{"$f":"'Tab 8.2_roh'!C77","v":683},{"$f":"'Tab 8.2_roh'!D77","v":1.7379134860050889},{"$f":"'Tab 8.2_roh'!E77","v":-42.265426880811496},{"$f":"'Tab 8.2_roh'!F77","v":42.160493827160494},{"$f":"'Tab 8.2_roh'!G77","v":937},{"$f":"'Tab 8.2_roh'!H77","v":1.6679720877242949},{"$f":"'Tab 8.2_roh'!I77","v":-42.585784313725497}]
["Beschäftigung schaffende Maßnahmen",null,null,{"$f":"'Tab 8.2_roh'!C78","v":2133},{"$f":"'Tab 8.2_roh'!D78","v":5.4274809160305342},{"$f":"'Tab 8.2_roh'!E78","v":-72.305894572838227},{"$f":"'Tab 8.2_roh'!F78","v":34.520148891406379},{"$f":"'Tab 8.2_roh'!G78","v":4046},{"$f":"'Tab 8.2_roh'!H78","v":7.202363998860724},{"$f":"'Tab 8.2_roh'!I78","v":-68.171806167400888}]
["dar.:","Arbeitsgelegenheiten",null,{"$f":"'Tab 8.2_roh'!C79","v":1807},{"$f":"'Tab 8.2_roh'!D79","v":4.5979643765903306},{"$f":"'Tab 8.2_roh'!E79","v":-70.299145299145295},{"$f":"'Tab 8.2_roh'!F79","v":34.723289777094543},{"$f":"'Tab 8.2_roh'!G79","v":3397},{"$f":"'Tab 8.2_roh'!H79","v":6.0470663628595842},{"$f":"'Tab 8.2_roh'!I79","v":-66.148480318883912}]
[null,"Teilhabe am Arbeitsmarkt",null,{"$f":"'Tab 8.2_roh'!C80","v":326},{"$f":"'Tab 8.2_roh'!D80","v":0.82951653944020354},{"$f":"'Tab 8.2_roh'!E80","v":-79.851668726823235},{"$f":"'Tab 8.2_roh'!F80","v":33.435897435897438},{"$f":"'Tab 8.2_roh'!G80","v":649},{"$f":"'Tab 8.2_roh'!H80","v":1.1552976360011393},{"$f":"'Tab 8.2_roh'!I80","v":-75.756443780351134}]
[null,null,null,null,null,null,null,null,null,"© Statistik der Bundesagentur für Arbeit"]
[]
["1) Ohne Ergebnisse zu Teilnahmen an Berufsorientierungsmaßnahmen."]
["2) Die Förderungen zur Teilhabe am Arbeitsmarkt sind insgesamt bundesweit übererfasst. Für einzelne Jobcenter fällt die Übererfassung deutlich höher aus. Näheres siehe unter folgendem Link: "]
["Förderung zur Teilhabe am Arbeitsmarkt - Übererfassung"]

{"sheet":"Hinweis_Schätzungen","index":20,"n_rows":14,"n_cols":2,"rows_kept":14,"cut":false,"hidden":false,"merged":[]}
[null,"Statistik der Arbeitslosen und Arbeitsuchenden"]
[null,"Stand: 26.03.2019"]
[null,"Methodische Hinweise - Schätzungen in der Statistik der Arbeitslosen und Arbeitsuchenden"]
[]
[null,"Schätzungen in der Arbeitslosenstatistik"]
[null,"Bei teilweisen oder vollständigen Lieferausfällen sowie unplausiblen Datenlieferungen eines Trägers werden für die betroffenen Regionen Schätzwerte für Arbeitslose bzw. Arbeitsuchende ermittelt und in die Berichterstattung einbezogen."]
[null,"Geschätzte Größen und Untergliederungen"]
[null,"Schätzwerte werden für Bestand bzw. Bewegungen (Zu- und Abgang) Arbeitsloser bzw. Arbeitsuchender auf Basis eines Fortschreibungsmodells ermittelt. Das Fortschreibungsmodell basiert auf der Annahme, dass sich die Arbeitslosigkeit in Gebieten mit vergleichbarer Arbeitsmarktstruktur in ähnlicher Weise entwickelt. Fehlen für einzelne Jobcenter aktuelle Arbeitslosenzahlen, lässt sich die Entwicklung im Vergleich zum Vormonat anhand der Entwicklung in vergleichbaren Regionen abschätzen. Eine Bestandsschätzung in einem Monat führt zu einer Schätzung der Bewegungsdaten in diesem und im darauf folgenden Monat, da die gemeldeten Bewegungsdaten nicht mit der Bestandsschätzung des Vormonats vereinbar sind.\n\nZur Ermittlung von Strukturen der Arbeitslosen werden die Schätzwerte eines Trägers (Zugang, Bestand und Abgang) nach den relativen Häufigkeiten dieser Strukturen im Vormonat auf die jeweiligen Merkmalskombinationen verteilt. Folgende Untergliederungen werden dabei berücksichtigt: \n-   Politisch-administrative Gliederung (bis zur Gemeinde) \n-   Administrative Gliederung der Bundesagentur für Arbeit (bis zur Geschäftsstelle)\n-   Administrative Gliederung im Rahmen des SGB II (Jobcenter)\n-   Rechtskreis\n-   Alter (in 5-Jahresklassen)\n-   Geschlecht\n-   Staatsangehörigkeit (Deutsche/Ausländer) \n-   Schwerbehindert  (ja/nein) \n-   Langzeitarbeitslos (ja/nein) \nBei tieferen Unterstrukturen (z. B. einzelne Staatsangehörigkeiten oder einzelne Kategorien bei der Dauer der Arbeitslosigkeit) werden die Schätzwerte der Kategorie „keine Angabe“ zugeordnet."]
[null,"Auswirkung von Schätzungen auf die Berichterstattung"]
[null,"Im Falle von Schätzungen können für die vom Lieferausfall betroffenen, aber nicht geschätzten Merkmale im jeweiligen Berichtsmonat grundsätzlich keine Nachweise für tiefere regionale Strukturen (AA/Jobcenter/Kreise/Gemeinden) erfolgen. Für diese Regionen ist auch die Berichterstattung von Jahressummen/-durchschnitten sowie der Vergleich mit anderen Berichtszeiträumen eingeschränkt.\n\nIn übergeordneten Regionen (Deutschland, West-/Ostdeutschland, Bundesländer, Bezirke der Regionaldirektionen, Vergleichstypen, Arbeitsmarktregionen) werden Ergebnisse auch für die vom Lieferausfall betroffenen, aber nicht geschätzten Merkmale ausgewiesen. Da die nicht geschätzten Merkmalsausprägungen der Kategorie „keine Angabe“ zugeordnet werden, sind diese in den betroffenen Berichtsmonaten unterzeichnet. Daher wird von Vergleichen mit anderen Zeiträumen abgesehen."]
[]
[null,"Weiterführende Informationen"]
[null,"Weitere Informationen zu Plausibilisierung und Schätzungen in der Arbeitslosenstatistik können dem Handbuch XSozial-BA-SGB II „Statistik der Arbeitslosen und Arbeitsuchenden“, Kapitel 3, entnommern werden, abrufbar unter"]
[null,"https://statistik.arbeitsagentur.de/DE/Navigation/Grundlagen/Datenquellen/Datenstandard-XSozial/Handbuch/Handbuecher-Nav.html"]

{"sheet":"Hinweis_Ausbildungsmarkt","index":21,"n_rows":46,"n_cols":2,"rows_kept":46,"cut":false,"hidden":false,"merged":[]}
[null,"Ausbildungsmarkt"]
[null,"Stand: 17.07.2019"]
[null,"Hinweise zu den Statistiken über den Ausbildungsmarkt"]
[]
[null,"Aktuelle Informationen"]
[]
[null,"August 2019\nNeuer Wertebereich des Merkmals \"Besuchte Schule\"\nAb dem Berichtsmonat August 2019 ändern sich der Wertebereich und die Häufigkeitsverteilung innerhalb des Merkmals „Besuchte Schule“ (Tabelle 5.1, 5.2, 6.). Als neue Ausprägung wird künftig auch über „Sonstige Schule“ berichtet; die Häufigkeiten für \"Allgemeinbildende Schule\" sinken bundesweit um 6 bis 7 % und für „Berufsbildende Schule“ um ca. 5 bis 6 %.\nHintergrund dieser Änderungen ist die Anwendung der länderübergreifenden Schulartengliederung des Definitionenkatalogs zur Schulstatistik der Kultusministerkonferenz in den operativen Systemen der BA und (ab November 2019 auch) im Meldeverfahren XSozial-BA-SGB II.\nEbenfalls im Zuge der operativen Anwendung dieser Klassifikation entfallen beim Merkmal „Art des Verbleibs“ (Tabelle 7.) die bisher berichteten Ausprägungen „Berufsvorbereitendes Jahr“ und „Berufsgrundbildungsjahr“. Sie sind nunmehr in der Ausprägung „Schulbildung“ enthalten.\n"]
[]
[null,"Januar 2018\nWeiterentwicklung und Revision der Statistik über Berufsausbildungsstellen\nAb Berichtsmonat Januar 2018 wird erstmals aus der weiterentwickelten Statistik über Berufsausbildungsstellen berichtet. Sie beinhaltet qualitative Verbesserungen und inhaltliche Erweiterungen. Die bisherigen Daten werden zudem beginnend mit dem Berichtsjahr 2006/2007 revidiert. Zum 30.09.2017, dem Abschluss des Berichtsjahres 2016/2017, weist das Neuverfahren 4.878 (-0,9 %) gemeldete Berufsausbildungsstellen weniger aus als das Altverfahren. Die betrieblichen Berufsausbildungsstellen liegen im Neuverfahren um 5.600 Stellen (1,1 %) höher, die außerbetrieblichen um 10.478 Stellen (-37,5 %) niedriger. Die unbesetzten Berufsausbildungsstellen liegen um 47 Stellen (0,1 %) unwesentlich höher als im Altverfahren. Einen ausführlichen Vergleich zwischen Neu- und Altverfahren bietet der Methodenbericht „Revision der Statistik über Berufsausbildungsstellen 2018“. Die inhaltlichen Änderungen beschreibt der Methodenbericht „Weiterentwicklung der Berufsausbildungsstellen-Statistik“ (Mai 2017). Beides findet sich unter"]
[null,"https://statistik.arbeitsagentur.de/DE/Statischer-Content/Grundlagen/Methodik-Qualitaet/Methodenberichte/Ausbildungsstellenmarkt/Generische-Publikationen/Methodenbericht-Weiterentwicklung-Berufsausbildungsstellen-Statistik.pdf?__blob=publicationFile"]
[]
[null,"Berichtsjahr 2016/2017"]
[null,"Bewerber für Berufsausbildungsstellen – Statistische Neuordnung der Versorgungsrelevanz von Maßnahmen und Praktika"]
[]
[null,"Bewerber für Berufsausbildungsstellen werden als versorgt gezählt, wenn sie eine Berufsausbildung oder eine Alternative zu einer Berufsausbildung aufweisen. Zu den Alternativen zählen u. a. bestimmte arbeitsmarktpolitische Maßnahmen und Praktika. Ab dem Berichtsjahr 2016/2017 zählen nur noch diejenigen Maßnahmen als versorgungsrelevant, die\n- einen Bildungscharakter aufweisen, indem sie die Chancen des Bewerbers auf dem Ausbildungsmarkt \n  erhöhen oder \n- auf eine Ausbildung vorbereiten oder\n- eine Ausbildung ersetzen oder \n- das Ziel eines Berufsabschlusses haben. \nBei Maßnahmen, die nicht das Ziel eines Berufsabschlusses aufweisen, muss eine Teilnahme von mindestens sechs Monaten vorliegen, damit die Maßnahmen als versorgungsrelevant berücksichtigt werden. Bei Praktika gilt ebenfalls eine Mindestdauer von sechs Monaten für die Zählung als Versorgungstatbestand. \nDie Änderung erfolgt für die Daten ab dem 1. Oktober 2016, rückwirkende Datenänderungen werden nicht vorgenommen. Bei einer simulierten Anwendung der Änderung für das Ausbildungsjahr 2015/2016 ergibt sich zum Berichtsjahresende (September 2016) eine Zunahme um ca. 1.100 unversorgte Bewerber, die bislang als Bewerber mit Alternative berücksichtigt wurden. Des weiteren ergeben sich geringfüge Verschiebungen bei dem Verbleib von geförderten zu ungeförderten Berufsausbildungen. Die Gesamtzahl der Bewerber und weitere Merkmale sind von der Änderung nicht betroffen."]
[]
[null,"Allgemeines\nSowohl die Agenturen für Arbeit (AA) als auch Jobcenter in gemeinsamen Einrichtungen (JC gE) und in alleiniger kommunaler Trägerschaft (JC zkT) haben Ausbildungsvermittlung nach § 35 Sozialgesetzbuch Drittes Buch (SGB III) durchzuführen. Träger der Grundsicherung können diese Aufgabe durch die AA wahrnehmen lassen (§ 16 Abs. 4 SGB II)."]
[]
[null,"Die Erfahrungen aus der Vergangenheit zeigen, dass der Einschaltungsgrad (gemeldete Ausbildungsstellen und gemeldete Bewerber) gemessen an Gesamtangebot und Gesamtnachfrage [1] sehr hoch ist. Ein nicht quantifizierbarer Teil der Inanspruchnahme durch Arbeitgeber und Jugendliche – insbesondere der freiwilligen Inanspruchnahme nach dem SGB III – richtet sich nach den jeweiligen Verhältnissen auf dem Ausbildungsmarkt. Bei wachsendem Nachfrageüberhang nutzen Ausbildungsbetriebe die Ausbildungsvermittlung seltener und später, die Jugendlichen jedoch häufiger und früher. Bei einem Angebotsüberhang verhält es sich umgekehrt. Daher sind direkte Rückschlüsse auf die absoluten Zahlen von Gesamtangebot und Gesamtnachfrage nicht möglich."]
[null,"Die Arbeitsverfahren bei den Trägern der Ausbildungsstellenvermittlung sind darauf ausgerichtet, bis zum 30. September möglichst für alle Bewerber eine Einmündung in eine Ausbildungsstelle zu erreichen oder eine Klärung des Vorhandenseins einer Alternative zur Berufsausbildung herbeizuführen. Auch danach werden die Vermittlungsbemühungen für unversorgte Bewerber fortgesetzt."]
[]
[null,"[1] Gesamtangebot: bis zum 30. September abgeschlossene Ausbildungsverträge zuzüglich der zum 30.\n   September gemeldeten, noch unbesetzten Ausbildungsstellen\n   Gesamtnachfrage: bis zum 30. September abgeschlossene Ausbildungsverträge zuzüglich der zum 30.\n   September gemeldeten, unversorgten Bewerber "]
[]
[null,"Definitionen"]
[]
[null,"Berichtsjahr\nDas Berichtsjahr ist der Zeitraum vom 1. Oktober bis zum 30. September des folgenden Jahres. Um alle Bewerber und Berufsausbildungsstellen, die während eines Berichtsjahres bei den AA und JC gemeldet waren, abzubilden, werden Bewerber und Berufsausbildungsstellen jeweils kumuliert seit Beginn des Berichtsjahres ausgewiesen. Das bedeutet, jeder Bewerber bzw. jede Berufsausbildungsstelle, die mindestens einmal während des Berichtsjahres gemeldet war, bleibt statistisch bis zum Ende des Berichtsjahres in der Grundgesamtheit enthalten (Prinzip der Anwesenheitsgesamtheit), auch wenn der Vermittlungsauftrag längst beendet wurde.\n"]
[]
[null,"Bewerber\nPersonenbezogene Ausdrücke wie „Bewerber“ bezeichnen Personen beiderlei Geschlechts. Differenzierungen nach dem Geschlecht werden durch die Attribute „weiblich“ oder „männlich“ kenntlich gemacht. "]
[null,"Als Bewerber für Berufsausbildungsstellen zählen diejenigen gemeldeten Personen, die im Berichtsjahr individuelle Vermittlung in eine betriebliche oder außerbetriebliche Berufsausbildungsstelle in anerkannten Ausbildungsberufen nach dem Berufsbildungsgesetz (BBiG) wünschen und deren Eignung dafür geklärt ist bzw. deren Voraussetzung dafür gegeben ist. Hierzu zählen auch Bewerber für eine Berufsausbildungsstelle in einem Berufsbildungswerk oder in einer sonstigen Einrichtung, die Ausbildungsmaßnahmen für Menschen mit Behinderungen durchführt. "]
[null,"Zu den Bewerbern für Berufsausbildungsstellen rechnen auch solche Jugendliche, die für eine Berufsausbildung im dualen System vorgemerkt wurden, sich aber im Zuge ihres individuellen Berufswahlprozesses im Laufe des Berichtsjahres aus unterschiedlichen Gründen für andere Ausbildungs-/ Bildungsalternativen – wie z. B. Schulbildung, Studium, Aufnahme einer Berufsausbildung außerhalb des dualen Systems oder auch eine Beschäftigung – entscheiden. Unter den gemeldeten Bewerbern befinden sich auch Personen, die die Schule nicht im laufenden Berichtsjahr, sondern im Vorjahr oder in früheren Jahren verlassen haben und somit zusätzlich zum Nachfragepotential des aktuellen Schulentlassjahres eine Ausbildung aufnehmen wollen."]
[null,"Folgende Statusgruppen zur Ausbildungsuche werden unterschieden: "]
[null,"Als einmündender Bewerber wird berücksichtigt, wer im Laufe des Berichtsjahres oder später eine Ausbildung aufnimmt. "]
[null,"Andere ehemalige Bewerber haben keine weitere aktive Hilfe bei der Ausbildungsuche nachgefragt, ohne dass der Grund explizit bekannt ist. \nWird die Ausbildungsuche fortgesetzt, obwohl der Bewerber bereits eine alternative Möglichkeit zur Ausbildung hat, wird dieser Kunde der Gruppe Bewerber mit Alternative zum 30.09. zugeordnet. Zu den Alternativen gehören z. B. Schulbildung, Berufsgrundschuljahr, Berufsvorbereitungsjahr, Berufsvorbereitende Bildungsmaßnahmen, Einstiegsqualifizierung Jugendlicher oder freiwillige soziale Dienste. "]
[null,"Zu den unversorgten Bewerbern rechnen Kunden, für die weder die Einmündung in eine Berufsausbildung, noch ein weiterer Schulbesuch, eine Teilnahme an einer Fördermaßnahme oder eine andere Alternative zum 30.09. bekannt ist und für die Vermittlungsbemühungen laufen."]
[]
[null,"Berufsausbildungsstellen\nAls Berufsausbildungsstellen zählen alle mit einem Auftrag zur Vermittlung gemeldeten und im Berichtjahr zu besetzenden betrieblichen und außerbetrieblichen Berufsausbildungsstellen für anerkannte Ausbildungsberufe nach dem BBiG, einschließlich der Ausbildungsplätze in Berufsbildungswerken und sonstigen Einrichtungen, die Ausbildungsmaßnahmen für Menschen mit Behinderungen (§ 102 SGB III) durchführen. Als betriebliche Berufsausbildungsstellen zählen gemeldete Berufsausbildungsstellen abzüglich Berufsausbildungsstellen in außerbetrieblichen Einrichtungen, abzüglich Berufsausbildungsstellen für Rehabilitanden mit Ausnahme der nach § 241 Abs. 2 SGB III geförderten Ausbildungsstellen. "]
[]
[null,"Erhebungszeitraum\nDie Daten werden monatlich mit Bezug auf einen bestimmten Stichtag (Mitte des Monats am allgemeinen Stichtag der Arbeitslosenstatistik) aufbereitet. Ausnahme ist der Zähltag zum Ende des Berichtsjahres im Berichtsmonat September, der 30. September. Für AA und JC gE werden die bis einschließlich zu diesem Tag gelieferten Daten berücksichtigt. Bei den JC zkT wird für das Berichtsjahresende auch die Datenlieferung zum Stichtag Oktober einbezogen, um Informationen berücksichtigen zu können, die zwischen dem regulären Zähltag Mitte September und dem 30. September erfasst wurden. Ergänzende Informationen finden Sie im Methodenbericht „Einheitlicher Datenstand zum Berichtsjahreswechsel und Revision der Ergebnisse zum Ende des Berichtsjahres 2008/2009“"]
[null,"https://statistik.arbeitsagentur.de/DE/Statischer-Content/Grundlagen/Methodik-Qualitaet/Methodenberichte/Ausbildungsstellenmarkt/Generische-Publikationen/Methodenbericht-Einheitlicher-Datenstand-zum-Berichtsjahreswechsel.pdf?__blob=publicationFile"]
[]
[null,"Historie\nDie regionale Zuordnung von Berufsausbildungsstellen erfolgt bis zum Berichtsjahr 2004/2005 nach dem Ort der betreuenden Dienststelle, ab 2005/2006 nach dem Arbeitsort. Bewerber für Berufsausbildungsstellen werden ab September 2003 nach dem Wohnort ausgewertet. Ab dem Berichtsjahr 2006/2007 wird für Bewerber ein differenzierter Status (der Ausbildungsuche) verarbeitet (bis 2005/2006: „nicht vermittelte Bewerber“). Ab dem Berichtsjahr 2007/2008 erfolgt eine tagesgenaue Erfassung von Bewerbern für Berufsausbildungsstellen und ihren Eigenschaften. Ab dem Berichtsjahr 2008/2009 werden in den Statistiken zu Bewerbern für Berufsausbildungsstellen die durch Addition ermittelten Gesamtergebnisse (einschließlich der Daten der JC zkT) publiziert. Eine alleinige Ausweisung der Ergebnisse aus den JC zkT ist aufgrund der kleinen Fallzahlen auf regionaler Ebene für den Ausbildungsmarkt nicht repräsentativ. \nMit Beginn des Berichtsjahres 2015/2016 wird in den Statistiken über Berufsausbildungsstellen und Bewerber für Berufsausbildungsstellen die  Neustrukturierung der berufskundlichen Gruppen berücksichtigt.  Damit werden auch Ausbildungswege, die neben dem Abschluss in einem anerkannten Ausbildungsberuf noch einen weiteren Abschluss ermöglichen („Abiturientenausbildungen“) zu den statistisch relevanten Ausbildungsberufen gezählt.\n"]
[]
[null,"Einschränkung wichtiger Merkmale\nDie Einführung des operativen Vermittlungs- Beratungs- und Informationssystems der Bundesagentur für Arbeit (VerBIS) im Jahr 2006 ging mit konzeptionellen Änderungen einher. Die Dimensionen „Status der Ausbildungsuche“ sowie „Verbleibsart“ sind daher grundsätzlich nicht vergleichbar mit den entsprechenden Dimensionen der Berichtsjahre vor Oktober 2006. Eine Ausnahme bilden die „unversorgten Bewerber“ sowie die „einmündenden Bewerber“. Diese sind jeweils im Berichtsmonat September uneingeschränkt vergleichbar zu den entsprechenden Statusgruppen der Vorjahre. \nDie tagesgenaue Berücksichtigung von Bewerberinformationen kann aus technischen Gründen erst ab Oktober 2007 erfolgen. Insofern sind die Ergebnisse des Berichtsjahres 2006/2007 nur mit leichten Einschränkungen vergleichbar mit den Ergebnissen ab Oktober 2007. \nDie Gesamtsumme aus Daten der AA/JC gE und der JC zkT enthält in geringem Umfang Überschneidungen, d. h. Bewerber, die sowohl von AA/JC gE als auch von JC zkT bei der Ausbildungsstellensuche unterstützt und gemeldet wurden und im Gesamtergebnis doppelt nachgewiesen werden. \nSolche Überschneidungen entstehen etwa in Folge des Eintretens von Hilfebedürftigkeit i. S. des SGB II, nachdem der Bewerber über eine AA eine Ausbildung suchte, bzw. umgekehrt bei Wegfall der Bedürftigkeit. Sie sind somit durchaus systemkonform. Anzahl und Struktur der Überschneidungen belegen die Richtigkeit der Einbeziehung in die Berichterstattung, ohne dass die Beurteilung des Gesamtangebotes nachhaltig eingeschränkt würde.  \nErgänzende Informationen zu Überschneidungen bei den gemeldeten Bewerbern sowie bei JC zkT gemeldeten unbesetzten Berufsausbildungsstellen sind in den Tabellen „Bewerber und Berufsausbildungsstellen - Analysedaten (Monatszahlen)“"]
[null,"http://statistik.arbeitsagentur.de/SiteGlobals/Forms/Suche/Einzelheftsuche_Formular.html?nn=1459822&topic_f=analyse"]
[null,"enthalten."]
[null,"Die Angaben zu den Berufsausbildungsstellen enthalten keine Daten von JC zkT. Nach Einschätzung der Statistik der BA dürften bei den JC zkT nur wenige ungeförderte Ausbildungsstellen nach dem Berufsbildungsgesetz (BBiG) gemeldet sein, die nicht gleichzeitig bei den AA/JC gE erfasst sind. Deshalb wird der Bewerberzahl einschließlich JC zkT die Zahl der Berufsausbildungsstellen ohne JC zkT gegenübergestellt. Auch auf regionaler Ebene tritt insoweit keine nennenswerte Verzerrung ein, wenn ausschließlich die bei den AA und JC gE gemeldeten Berufsausbildungsstellen verwendet werden. Dagegen würde eine Berücksichtigung nur der bei den AA und JC gE gemeldeten Bewerber zu ernsthaften Verfälschungen führen. "]

{"sheet":"Hinweis_Arbeitslosengeld","index":22,"n_rows":30,"n_cols":2,"rows_kept":30,"cut":false,"hidden":false,"merged":[]}
[null,"Statistik über Arbeitslosengeld und Sperrzeiten"]
[null,"Stand: März 2020"]
[null,"Methodische Hinweise zur Statistik über Arbeitslosengeld und Sperrzeiten"]
[null,"Kurzbeschreibung"]
[null,"Die Ergebnisse aus der Statistik über Arbeitslosengeld werden als wichtige Indikatoren für die Beurteilung der Lage auf dem nationalen Arbeitsmarkt, zur Konjunkturbeobachtung und für Finanzprognosen herangezogen. Die Zahlen über Empfänger von Arbeitslosengeld nach dem SGB III und deren Restanspruchsdauer, die auch einen voraussichtlichen Übergang zu einem Leistungsbezug nach dem SGB II erkennen lassen, sind von hohem politischen und öffentlichen Interesse. Sie werden auch für die Haushaltsplanungen der Bundesagentur für Arbeit genutzt.\n\nDie Statistik über Arbeitslosengeld wird im März 2020 revidiert. Wesentliche Neuerung ist die differenzierte Darstellung von Personengruppen. Dadurch wird zukünftig präzise über Anspruchsberechtigte, Anspruchsberechtigte in Sperrzeit, Leistungsbeziehende, Leistungsbeziehende von Arbeitslosengeld bei Arbeitslosigkeit und Leistungsbeziehende von Arbeitslosengeld bei Weiterbildung berichtet."]
[]
[]
[]
[]
[null,"Anspruchsberechtigt ist, wer Arbeitslosengeld bei Arbeitslosigkeit oder bei Weiterbildung als leistungsbeziehende Person tatsächlich bezieht oder dessen Leistungsbezug aufgrund des Eintritts einer Sperrzeit ruht.\nNeben Sperrzeiten zählen sonstige Ruhenszeiten sowie Versagens- und Entziehungszeiten zu Ereignissen, die eine mindernde Wirkung auf die Leistungsdauer nach sich ziehen können."]
[]
[null,"Anspruch auf Arbeitslosengeld bei Arbeitslosigkeit haben Antragsteller nach § 137 Abs. 1 SGB III, die arbeitslos sind, sich bei der Agentur für Arbeit arbeitslos gemeldet und die Anwartschaftszeit erfüllt haben.\nDie Höhe des Arbeitslosengeldes beträgt 60 % bzw. 67 % des zuletzt erhaltenen pauschalierten Nettoarbeitsentgelts (§ 149 SGB III).\nDie Anspruchsdauer beträgt mindestens sechs Monate, bei älteren Arbeitslosen kann sie bis zu 24 Monaten betragen. Sie richtet sich nach der Dauer des Versicherungspflichtverhältnisses und dem Alter des oder der Arbeitslosen (§ 147 SGB III).\nArbeitslos sind Personen nach § 16 Abs. 1 SGB III, die vorübergehend nicht in einem Beschäftigungsverhältnis stehen (Beschäftigungslosigkeit), eine versicherungspflichtige Beschäftigung suchen, um Beschäftigungslosigkeit zu beenden (Eigenbemühungen), und dabei den Vermittlungsbemühungen der Agentur für Arbeit zur Verfügung stehen (Verfügbarkeit).\nIn folgenden Fallkonstellationen zählen Bezieher von Arbeitslosengeld nicht als arbeitslos:\n1. Minderung der Leistungsfähigkeit i. S. v. § 145 SGB III\n2. Leistungsfortzahlung anlässlich einer Arbeitsunfähigkeit nach § 146 SGB III\n3. Teilnahme an einer Maßnahme nach § 45 SGB III (Maßnahmen zur Aktivierung und beruflichen Eingliederung)"]
[]
[null,"Arbeitslosengeld bei Weiterbildung (AlgW), früher Unterhaltsgeld (Uhg), erhalten Personen, die Anspruch auf Arbeitslosengeld haben und sich in einer Weiterbildungsmaßnahme gemäß § 81 SGB III befinden. Arbeitslosigkeit ist für den Anspruch auf AlgW keine zwingende Voraussetzung, wenn diese Voraussetzungen alleine wegen der Weiterbildungsmaßnahme nicht erfüllt sind (§ 136 Abs. 1 Nr. 2 SGB III). Die Höhe des AlgW entspricht der des Arbeitslosengeldes bei Arbeitslosigkeit."]
[]
[null,"Sperrzeiten treten ein, wenn sich Antragstellende oder Beziehende von Arbeitslosengeld bzw. Arbeitslosengeld bei Weiterbildung (AlgW) ohne wichtigen Grund versicherungswidrig verhalten haben. Dann ruht der Leistungsbezug für einen gesetzlich festgelegten Zeitraum. Gründe für versicherungswidriges Verhalten sind Arbeitsaufgabe, Ablehnung einer angebotenen Arbeit, unzureichende Bemühungen eine neue Anstellung zu finden, Ablehnung oder Abbruch einer beruflichen Eingliederungsmaßnahme, Meldeversäumnis und verspätete Arbeitsuchendmeldung (siehe § 159 Abs. 1 SGB III).\nSummieren sich die Sperrzeitdauern auf 21 Wochen, erlischt der Leistungsanspruch der Person (§ 161 Abs. 1 Nr. 2 SGB III)."]
[]
[null,"Zugänge in und Abgänge aus dem Bezug von Arbeitslosengeld bilden die Zahl der im Laufe des Berichtszeitraums begonnenen oder beendeten Leistungsfälle in einer Leistungsartgruppe ab; in einem Berichtszeitraum können mehrere Abgänge/Zugänge eines Empfängers von Arbeitslosengeld erfolgt sein, die alle zu zählen sind (Fallkonzept)."]
[]
[null,"Abgrenzung der Statistik über Arbeitslosengeld gegenüber monatlichen Abrechnungsergebnissen von Einnahmen und Ausgaben des BA-Haushalts im SGB III"]
[null,"Während die Statistik über Arbeitslosengeld ausschließlich monatliche Geldbeträge solcher Empfänger von Arbeitslosengeld einbezieht, die zum statistischen Stichtag bestandsrelevant sind, bezieht die haushalterische Ausgabensumme in der Regel alle Ausgaben eines Zeitraums ein, also auch für Leistungsbeziehende, die nicht bestandsrelevant sind. Zudem werden die Zahlungsflüsse dem jeweiligen Monat zugerechnet, in dem die Zahlung erfolgt. In der Statistik über Arbeitslosengeld werden Bestände oder Zugänge dem Monat zugeordnet, für den ein Leistungsanspruch auf Arbeitslosengeld besteht."]
[]
[null,"Weiterführende Informationen"]
[null,"Weitergehende Informationen finden Sie im Methodenbericht zur Revision der Statistik über Arbeitslosengeld, im Glossar der Statistik der BA sowie im Qualitätsbericht zur Statistik über Arbeitslosengeld nach dem SGB III:"]
[null,"Methodenbericht zur Revision der Statistik über Arbeitslosengeld"]
[null,"Methodenbericht zur Revision der Statistik über Arbeitslosengeld - Revisionseffekte"]
[null,"Glossar der Statistik der Bundesagentur für Arbeit (BA)"]
[null,"Qualitätsberichte zur Statistik über Arbeitslosengeld (SGB III)"]
[]
[null,"Historie (Auszug)\nDie Daten wurden bis Dezember 2006 im DV-Verfahren coLei Alg/Alhi-Uhg (Computerunterstützte Leistungsgewährung) erhoben, das ab Oktober 2005 stufenweise von COLIBRI (Computerunterstütztes Leistungsberechnungs- und Informationssystem) abgelöst wurde. \nDie Bestandsdaten, die bis Dezember 2002 in der Statistischen Datenbank der Bundesagentur für Arbeit (STADA) erhoben wurden, sind uneingeschränkt vergleichbar. Ab Januar 2003 wurden sie mit einem neuen Verfahren im DataWarehouse (DWH) der Statistik aufbereitet. Ein Vergleich dieser Bestände mit denen der Statistischen Datenbank vor 2003 ist nur bedingt möglich. Die Bewegungsdaten werden erst seit Juli 2003 im DataWarehouse (DWH) der Statistik aufbereitet. Daten vor diesem Zeitpunkt liegen nicht vor."]

{"sheet":"Hinweis_Alg_Revision","index":23,"n_rows":32,"n_cols":5,"rows_kept":32,"cut":false,"hidden":false,"merged":[[26,1,26,4],[27,1,27,4],[29,1,29,4],[3,1,3,4],[4,1,4,4],[6,1,6,4],[8,1,8,4],[11,1,11,2],[11,4,21,4],[16,1,16,2]]}
[null,null,null,null,"Arbeitslosengeld"]
[null,null,null,null,"Stand: 24.08.2020"]
[null,"Methodische Hinweise - Revision der Statistik über Arbeitslosengeld "]
[null,"Die Statistik über Arbeitslosengeld nach dem SGB III wurde im März 2020 revidiert. Wesentliche Neuerung ist die differenzierte Darstellung von Personengruppen. Dadurch  wird zukünftig präzise über Anspruchsberechtigte insgesamt sowie in Sperrzeit und Leistungsbeziehenden von Arbeitslosengeld bei Arbeitslosigkeit und bei Weiterbildung berichtet. Ziel der Revision der Arbeitslosengeldstatistik ist, eine umfassende und stringente Abbildung der statistischen Größen mit einem möglichst einfachen Darstellungssystem einzuführen."]
[null,"Schematische Darstellung der Berichtssystematik"]
[]
[null,"In der Abbildung werden die Personengruppen der bisherigen und zukünftigen Berichtssystematik schematisch gegenübergestellt. In der Arbeitslosengeldstatistik wird zukünftig von Anspruchsberechtigten gesprochen, die sich gemäß der neuen Systematik in Leistungsbeziehende und Anspruchsberechtigte in Sperrzeiten unterteilen. Anspruchsberechtigt ist, wer Arbeitslosengeld bei Arbeitslosigkeit oder bei Weiterbildung als leistungsbeziehende Person tatsächlich bezieht oder dessen Leistungsbezug aufgrund des Eintritts einer Sperrzeit, Ruhenszeiten mit Minderung der Anspruchsdauer oder Versagens- und Entziehenszeiten mit Minderungswirkung ruht.\n"]
[null,"Quantitative Veränderungen"]
[null,"Deutschland"]
[null,"Jahresdurchschnitt 2019"]
[]
[null,"Altes Messkonzept",null,null,"Nebenstehend sind die Veränderungen infolge der Revision anhand des Bestandes 2019 dargestellt. Insgesamt ergeben sich keine gravierenden Veränderungen in der Berichterstattung. \n\nIm Fokus der Berichterstattung stehen die Leistungsbeziehenden von Arbeitslosengeld bei Arbeitslosigkeit. Daneben werden Anspruchs-berechtigte und Anspruchsberechtigte in Sperrzeit als Eckwerte in die Berichterstattung aufgenommen.\n\n\n\n\n\n"]
[null,"Empfänger von Arbeitslosengeld",816298.41666666663]
[null,"bei Arbeitslosigkeit",749923]
[null,"bei Weiterbildung",66375.416666666672]
[]
[null,"Neues Messkonzept"]
[null,"Anspruchsberechtigte (AB)",836765.08333333337]
[null,"Leistungsbeziehende (LB)",810292.25]
[null,"Alg-A Leistungsbeziehende",743943.58333333337]
[null,"Alg-W Leistungsbeziehende",66348.666666666672]
[null,"Anspruchsberechtigte in Sperrzeit",26472.833333333332]
[]
[null,"Alg-A  Arbeitslosengeld bei Arbeitslosigkeit"]
[null,"Alg-W  Arbeitslosengeld bei Weiterbildung"]
[]
[null,"Die Revision wirkt sich in den Regionen unterschiedlich aus. Informationen zu den quantitativen Veränderungen bis auf Kreis- und Agenturebene sind über die Interentseite der Statistik der Bundesagentur für Arbeit abrufbar:\n"]
[null,"Gegenüberstellung_bisheriges_neues_Messkonzept.xlsx"]
[]
[null,"Weiterführende Informationen"]
[null,"Methodenbericht zur Revision der Statistik über Arbeitslosengeld"]
[null,"Methodenbericht zur Revision der Statistik über Arbeitslosengeld - Revisionseffekte"]

{"sheet":"Hinweis_SGBII_erw-tät_ELB","index":24,"n_rows":14,"n_cols":2,"rows_kept":14,"cut":false,"hidden":false,"merged":[]}
[null,"Grundsicherung für Arbeitsuchende (SGB II)"]
[null,"Stand: 17.04.2020"]
[null,"Methodische Hinweise zur Erwerbstätigkeit von erwerbsfähigen Leistungsberechtigten"]
[null,"Erwerbstätige erwerbsfähige Leistungsberechtigte\n"]
[null,"Erwerbstätige erwerbsfähige Leistungsberechtigte – oder kurz: erwerbstätige ELB – sind erwerbsfähige Regelleistungsberechtigte in der Grundsicherung für Arbeitsuchende, die Arbeitslosengeld II beziehen und zugleich über zu berücksichtigendes Einkommen aus abhängiger Erwerbstätigkeit (Bruttoeinkommen) und/oder über verfügbares Einkommen aus selbständiger Tätigkeit (Betriebsgewinn) verfügen."]
[]
[null,"Abhängig erwerbstätige ELB – Differenzierung nach Einkommensgrößenklassen\nDie Teilgruppe der abhängig erwerbstätigen ELB wird in der Berichterstattung unter anderem nach der Höhe des zu berücksichtigenden Einkommens aus Erwerbstätigkeit differenziert. \nHierfür werden seit dem 01.07.2019 die folgenden Bruttoentgeltgrenzen verwendet:\n- bis 450,00 Euro: geringfügige Beschäftigungen (Minijobs), Zahlung von pauschalierten Sozialabgaben durch den Arbeitgeber\n- 450,01 Euro bis 1.300,00 Euro: Übergangsbereich der sog. Midi-Jobs mit reduzierten Arbeitnehmerbeiträgen zur Sozialversicherung\n- ab 1.300,01 Euro: reguläre sozialversicherungspflichtige Beschäftigungsverhältnisse\nBis zum 30.06.2019 galten folgende Bruttoentgeltgrenzen: \nbis 450,00 Euro / 450,01 Euro bis 850,00 Euro / ab 850,01 Euro.\nBis zum 31.12.2012 galten folgende Bruttoentgeltgrenzen: \nbis 400,00 Euro / 400,01 Euro bis 800,00 / ab 800,01 Euro\n"]
[]
[null,"Abhängig erwerbstätige ELB – Differenzierung nach Merkmalen der Beschäftigungsstatistik \nÜber eine integrierte Auswertung der Grundsicherungsstatistik SGB II mit der Beschäftigungsstatistik werden diejenigen abhängig erwerbstätigen ELB identifiziert, die zum Betrachtungszeitpunkt sozialversicherungspflichtig oder ausschließlich geringfügig beschäftigt sind. Für diese „beschäftigten ELB\" können dadurch ergänzende Strukturinformationen gewonnen werden, z. B. zur Arbeitszeit, dem Wirtschaftszweig, dem Beruf oder der Ausbildung."]
[]
[null,"Selbstständig erwerbstätige ELB \nSelbstständig erwerbstätige ELB werden anhand ihres verfügbaren Erwerbseinkommens bzw. Betriebsgewinns identifiziert. Bis März 2015 wurden hierfür das zu berücksichtigende Einkommen bzw. die Betriebseinnahmen verwendet. Statistische Analysen zeigen jedoch, dass die Betriebseinnahmen über die Datenquellen hinweg uneinheitlich erfasst und übermittelt wurden. Dagegen ist der Betriebsgewinn eine verlässliche Größe, die datenquellenübergreifende Vergleiche ermöglicht. Eine Differenzierung nach der Höhe des Betriebsgewinns ist ebenfalls möglich.\nBeachten Sie hierzu auch den Methodenbericht „Erwerbstätige Arbeitslosengeld II-Bezieher: Anpassung bei Messung und Datenquelle\" unter:\n\n"]
[null,"http://statistik.arbeitsagentur.de/DE/Statischer-Content/Grundlagen/Methodik-Qualitaet/Methodenberichte/Grundsicherung-Arbeitsuchende-SGBII/Generische-Publikationen/Methodenbericht-Erwerbstaetige-AlgII-Bezieher.pdf?__blob=publicationFile"]
[]
[null,"Datengrundlagen und Datenverfügbarkeit\nDie Statistik der Grundsicherung für Arbeitsuchende basiert auf Prozessdaten der Jobcenter, also auf den Daten der IT-Verfahren zur Gewährung der Leistungen zur Sicherung des Lebensunterhaltes nach dem SGB II.\nIn den gemeinsamen Einrichtungen (gE) wird das Fachverfahren ALLEGRO eingesetzt, das seit Juli 2015 das Altverfahren A2LL vollständig abgelöst hat.\nZugelassene kommunale Träger (zkT) verwenden eigene IT-Verfahren und übermitteln ihre Einzeldaten gemäß § 51b SGB II über den vereinbarten Datenstandard XSozial-BA-SGB II. Eine zuverlässige Differenzierung nach Einkommen aus Erwerbstätigkeit ist für gE ab dem Berichtsmonat Januar 2007, für zkT ab Juni 2009 möglich. Fehlende oder unvollständige Informationen werden ab der Ebene der Bundesländer durch ein lineares Hochrechnungsverfahren ausgeglichen.\nAuswertungen aus der Grundsicherungsstatistik SGB II werden grundsätzlich auf Basis der Daten mit einer Wartezeit von drei Monaten vorgenommen. Auswertungen für erwerbstätige ELB nach Merkmalen der Beschäftigungsstatistik haben eine Wartezeit von sechs Monaten."]

{"sheet":"Hinweise_Allgemein","index":25,"n_rows":12,"n_cols":2,"rows_kept":12,"cut":false,"hidden":false,"merged":[]}
[null,"Übergreifend"]
[null,"Stand: 07.05.2019"]
[null,"Methodische Hinweise"]
[]
[null,"Aktueller Hinweis zur Arbeitslosenstatistik\nDie Jobcenter in gemeinsamer Einrichtung haben mit einer Überprüfung von Bewerber-Datensätzen mit möglicherweise fehlerhaftem Arbeitsmarkt-Status begonnen. Dies kann sich erhöhend auf die Zahl der Arbeitslosen im Rechtskreis SGB II auswirken. Bundesweit sind die Auswirkungen derzeit nicht nennenswert."]
[]
[null,"Alleinerziehende\nIn der Arbeitslosenstatistik wird das Merkmal Alleinerziehend durch eine Befragung des Arbeitslosen bzw. des Arbeitsuchenden ermittelt. Insofern liegt eine andere Erfassungslogik zugrunde als in der Grundsicherungsstatistik, die auf die (leistungsrelevanten) erfassten Lebensumstände zugreift (z.B. minderjähriges Kind und kein Partner in der Bedarfsgemeinschaft). Deshalb sind die arbeitslosen Alleinerziehenden im Rechtskreis SGB II nicht exakt deckungsgleich mit den arbeitslosen erwerbsfähigen Alleinerziehenden."]
[]
[null,"MINT-Berufe\nDas spezifische Berufsaggregat \"MINT-  Berufe\" umfasst alle Tätigkeiten, für deren Ausübung ein hoher Anteil an Kenntnissen aus den Bereichen Mathematik, Informatik, Naturwissenschaften und/oder Technik erforderlich ist. Dabei wird auch das Bauen und Instandhalten technischer Anlagen und Geräte als zentraler Bestandteil einer Tätigkeit zu den MINT-Qualifikationen gezählt. Das Berufsaggregat \"MINT-Berufe\" umfasst neben den hochqualifizierten MINT-Berufen auch die sogenannten mittelqualifizierten MINT-Berufe."]
[null,"Spezifische Berufsaggregate auf Grundlage der KldB 2010"]
[]
[null,"Arbeitslose Nichtleistungsempfänger im Rechtskreis SGB III\nArbeitslosigkeit im Rechtskreis SGB III ohne Leistungsanspruch kann verschiedene Gründe haben: \nDie arbeitslose Person hat (noch) keinen Anspruch auf Arbeitslosengeld erworben, weil entweder die vorangegangene Phase der Erwerbstätigkeit nicht ausreicht (Anwartschaftszeit nicht erfüllt) oder noch keine sozialversicherungspflichtige Beschäftigung bestanden hat.\n\nDie Person hat ihren Anspruch auf Arbeitslosengeld bereits aufgebraucht, ist nicht hilfebedürftig und bezieht deshalb kein Arbeitslosengeld II. Dies ist dann der Fall, wenn Vermögen oder laufendes Einkommen im Haushalt zu hoch ausfallen.\n\nPersonen, die Arbeitslosengeld II bezogen haben und bei denen die Hilfebedürftigkeit endet (beispielsweise weil der Partner eine Beschäftigung aufnimmt), werden zu Nichtleistungsempfängern, wenn sie sich weiterhin den Vermittlungsbemühungen der Agentur zur Verfügung stellen. Sie werden dann nicht mehr dem Rechtskreis SGB II, sondern dem Rechtskreis SGB III zugeordnet.\n\nArbeitslose, die im RK SGB II betreut werden, können sich nachträglich als Nichtleistungsempfänger erweisen, wenn der Antrag auf Leistungen aus der Grundsicherung letztlich abgelehnt und die Zuständigkeit des Rechtskreises SGB III festgestellt wird. Diese Person wird nicht als erwerbsfähiger Leistungsberechtigter, aber mindestens bis zur Ablehnung des Leistungsantrags als Person im Rechtskreis SGB II erfasst.\n\nArbeitslose Leistungsempfänger im Rechtskreis SGB III erhalten Arbeitslosengeld und ggf. ab 1. Januar 2017 aufstockend Arbeitslosengeld II. Aufgrund von zeitverzögerten Umstellungen auf den Rechtskreis SGB II erhält eine geringe Zahl Leistungen aus der Grundsicherung für Arbeitsuchende. \n\nEs handelt sich bei der Gruppe der arbeitslosen Nichtleistungsempfänger im Rechtskreis SGB III nicht um die Abgrenzung eines operativ erfassten Merkmals, sondern um eine aus verschiedenen Statistiken abgeleitete Größe. Unter Verknüpfung der Daten aus der integrierten Arbeitslosen-und der SGB III-Leistungsstatistik und zusätzlich der integrierten Grundsicherungsstatistik ist es möglich, für jeden Arbeitslosen im Rechtskreis SGBIII zu überprüfen, ob dieser Arbeitslosengeld nach dem SGB III bezieht und/oder leistungsanpruchsberechtigt nach dem SGB II ist. Wurde eine Person bei keiner dieser Abfragen gefunden, erfolgt die Zuordnung zur Gruppe der Nichtleistungsempfänger. \n\n"]

{"sheet":"Statistik-Infoseite","index":26,"n_rows":43,"n_cols":7,"rows_kept":43,"cut":false,"hidden":false,"merged":[[12,1,12,3],[5,0,5,6],[8,1,8,3],[9,1,9,3],[10,1,10,3],[11,1,11,3],[25,1,25,3],[13,1,13,3],[14,1,14,3],[15,1,15,3],[16,1,16,2],[18,1,18,3],[19,1,19,3],[20,1,20,3],[21,1,21,3],[22,1,22,3],[23,1,23,3],[24,1,24,3],[42,0,42,1],[26,1,26,3],[27,1,27,3],[28,1,28,3],[29,1,29,3],[30,1,30,3],[31,1,31,3],[32,1,32,3],[34,0,34,6],[36,0,36,6],[38,0,39,6],[41,0,41,6]]}
[]
[null,null,null,null,null,null,"Stand: 06.08.2020"]
["Statistik-Infoseite"]
[]
[]
["Im Internet stehen statistische Informationen unterteilt nach folgenden Themenbereichen zur Verfügung:"]
[]
[null,"Fachstatistiken:"]
[null,"Arbeitsuche, Arbeitslosigkeit und Unterbeschäftigung"]
[null,"Ausbildungsmarkt"]
[null,"Beschäftigung"]
[null,"Einnahmen/Ausgaben"]
[null,"Förderung und berufliche Rehabilitation"]
[null,"Gemeldete Arbeitsstellen"]
[null,"Grundsicherung für Arbeitsuchende (SGB II)"]
[null,"Leistungen SGB III"]
[]
[null,"Themen im Fokus:"]
[null,"Berufe"]
[null,"Bildung"]
[null,"Corona"]
[null,"Demografie"]
[null,"Eingliederungsbilanzen"]
[null,"Entgelt"]
[null,"Fachkräftebedarf"]
[null,"Familien und Kinder"]
[null,"Frauen und Männer"]
[null,"Langzeitarbeitslosigkeit"]
[null,"Menschen mit Behinderungen"]
[null,"Migration"]
[null,"Regionale Mobilität"]
[null,"Wirtschaftszweige"]
[null,"Zeitarbeit"]
[]
["Die Methodischen Hinweise der Statistik bieten ergänzende Informationen."]
[]
["Die Qualitätsberichte der Statistik erläutern die Entstehung und Aussagekraft der jeweiligen Fachstatistik."]
[]
["Das Glossar enthält Erläuterungen zu allen statistisch relevanten Begriffen, die in den verschiedenen Produkten der Statistik der BA Verwendung finden."]
[]
[]
["Abkürzungen und Zeichen, die in den Produkten der Statistik der BA vorkommen, werden im "]
["Abkürzungsverzeichnis",null,"bzw. der Zeichenerklärung der Statistik der BA erläutert."]